﻿"Item Id","Item URI","Dublin Core:Alternative Title","Dublin Core:Abstract","Dublin Core:Table Of Contents","Dublin Core:Date Available","Dublin Core:Date Created","Dublin Core:Date Accepted","Dublin Core:Date Copyrighted","Dublin Core:Date Submitted","Dublin Core:Date Issued","Dublin Core:Date Modified","Dublin Core:Date Valid","Dublin Core:Access Rights","Dublin Core:License","Dublin Core:Conforms To","Dublin Core:Has Format","Dublin Core:Has Part","Dublin Core:Has Version","Dublin Core:Is Format Of","Dublin Core:Is Part Of","Dublin Core:Is Referenced By","Dublin Core:Is Replaced By","Dublin Core:Is Required By","Dublin Core:Is Version Of","Dublin Core:References","Dublin Core:Replaces","Dublin Core:Requires","Dublin Core:Extent","Dublin Core:Medium","Dublin Core:Bibliographic Citation","Dublin Core:Spatial Coverage","Dublin Core:Temporal Coverage","Dublin Core:Accrual Method","Dublin Core:Accrual Periodicity","Dublin Core:Accrual Policy","Dublin Core:Audience","Dublin Core:Audience Education Level","Dublin Core:Mediator","Dublin Core:Instructional Method","Dublin Core:Provenance","Dublin Core:Rights Holder","Dublin Core:Title","Dublin Core:Subject","Dublin Core:Description","Dublin Core:Creator","Dublin Core:Source","Dublin Core:Publisher","Dublin Core:Date","Dublin Core:Contributor","Dublin Core:Rights","Dublin Core:Relation","Dublin Core:Format","Dublin Core:Language","Dublin Core:Type","Dublin Core:Identifier","Dublin Core:Coverage","Item Type Metadata:Text","Item Type Metadata:Interviewer","Item Type Metadata:Interviewee","Item Type Metadata:Location","Item Type Metadata:Transcription","Item Type Metadata:Local URL","Item Type Metadata:Original Format","Item Type Metadata:Physical Dimensions","Item Type Metadata:Duration","Item Type Metadata:Compression","Item Type Metadata:Producer","Item Type Metadata:Director","Item Type Metadata:Bit Rate/Frequency","Item Type Metadata:Time Summary","Item Type Metadata:Email Body","Item Type Metadata:Subject Line","Item Type Metadata:From","Item Type Metadata:To","Item Type Metadata:CC","Item Type Metadata:BCC","Item Type Metadata:Number of Attachments","Item Type Metadata:Standards","Item Type Metadata:Objectives","Item Type Metadata:Materials","Item Type Metadata:Lesson Plan Text","Item Type Metadata:URL","Item Type Metadata:Event Type","Item Type Metadata:Participants","Item Type Metadata:Birth Date","Item Type Metadata:Birthplace","Item Type Metadata:Death Date","Item Type Metadata:Occupation","Item Type Metadata:Biographical Text","Item Type Metadata:Bibliography","Item Type Metadata:First Name (English)","Item Type Metadata:Last Name (English)","Item Type Metadata:Address","Item Type Metadata:City","Item Type Metadata:State","Item Type Metadata:Business (English)","Item Type Metadata:Provenance (English)","Item Type Metadata:Provenance (Arabic)","Item Type Metadata:Business (Arabic)","Item Type Metadata:Last Name (Arabic)","Item Type Metadata:First Name (Arabic)","Item Type Metadata:Player","Omeka Legacy File:Additional Creator","Omeka Legacy File:Transcriber","Omeka Legacy File:Producer","Omeka Legacy File:Render Device","Omeka Legacy File:Render Details","Omeka Legacy File:Capture Date","Omeka Legacy File:Capture Device","Omeka Legacy File:Capture Details","Omeka Legacy File:Change History","Omeka Legacy File:Watermark","Omeka Legacy File:Encryption","Omeka Legacy File:Compression","Omeka Legacy File:Post Processing","Omeka Image File:Width","Omeka Image File:Height","Omeka Image File:Bit Depth","Omeka Image File:Channels","Omeka Image File:Exif String","Omeka Image File:Exif Array","Omeka Image File:IPTC String","Omeka Image File:IPTC Array","Omeka Video File:Bitrate","Omeka Video File:Duration","Omeka Video File:Sample Rate","Omeka Video File:Codec","Omeka Video File:Width","Omeka Video File:Height","PDF Text:Text","Users Elements:Test","Test Elements:Test",tags,file,itemType,collection,public,featured
42325,https://lebanesestudies.omeka.chass.ncsu.edu/items/show/42325,,,,,,,,,,,,,,,,,,,,,,,,,,,,,,,,,,,,,,,,,"Letter from Ameen Rihani to Martin Sprengling, 1932 August 27","Letter writing, English^^Correspondence^^ American literature--Arab American authors^^ Rihani, Ameen Fares, 1876-1940","A letter from Ameen Rihani to Martin Sprengling, dated August 27, 1932.","Ameen Rihani","Ameen Rihani Organization","Moise A. Khayrallah Center for Lebanese Diaspora Studies",1932-08-27,,"Donor retains full ownership of any and all copyright currently controlled in agreement with Khayrallah Center. Nonexclusive right to authorize all uses of these materials for non-commercial research, scholarly, or other educational purposes are granted to Khayrallah Center pursuant to Creative Commons Attribution-NonCommercial-ShareAlike (CC BY-NC-SA).",,Text/pdf,"English ",Text,Rihani2018AR39_272,"Freike, Lebanon",,,,,,,,,,,,,,,,,,,,,,,,,,,,,,,,,,,,,,,,,,,,,,,,,,,,,,,,,,,,,,,,,,,,,,,,,,,,,"1930's,Martin Sprengling,University of Chicago",https://lebanesestudies.omeka.chass.ncsu.edu/files/original/dbf2f5730bc015d731c36cf7bd18f8c8.pdf,,"Ameen Rihani: English Letters",1,0
42732,https://lebanesestudies.omeka.chass.ncsu.edu/items/show/42732,,,,,,,,,,,,,,,,,,,,,,,,,,,,,,,,,,,,,,,,,"Letter from Martin Sprengling to Ameen Rihani, 1926 August 5","Letter writing, English^^Correspondence^^ American literature--Arab American authors^^ Rihani, Ameen Fares, 1876-1940","A letter from Martin Sprengling to Ameen Rihani, dated August 5, 1926.","Martin Sprengling ","Ameen Rihani Organization","Moise A. Khayrallah Center for Lebanese Diaspora Studies",1926-08-05,,"Donor retains full ownership of any and all copyright currently controlled in agreement with Khayrallah Center. Nonexclusive right to authorize all uses of these materials for non-commercial research, scholarly, or other educational purposes are granted to Khayrallah Center pursuant to Creative Commons Attribution-NonCommercial-ShareAlike (CC BY-NC-SA).",,Text/pdf,"English ",Text,Rihani2019AR27_156,"Chicago, Illinois",,,,,,,,,,,,,,,,,,,,,,,,,,,,,,,,,,,,,,,,,,,,,,,,,,,,,,,,,,,,,,,,,,,,,,,,,,,,,"1920's,Martin Sprengling,University of Chicago",https://lebanesestudies.omeka.chass.ncsu.edu/files/original/800be060acbdc88244b6caff625c9369.pdf,,"Ameen Rihani: English Letters",1,0
42975,https://lebanesestudies.omeka.chass.ncsu.edu/items/show/42975,,,,,,,,,,,,,,,,,,,,,,,,,,,,,,,,,,,,,,,,,"Letter from Grace Dickinson Sperling to Ameen Rihani, undated ","Letter writing, English^^Correspondence^^ American literature--Arab American authors^^ Rihani, Ameen Fares, 1876-1940","A letter from Grace Dickinson Sperling to Ameen Rihani, undated.","Grace Dickinson Sperling^^University of Chicago","Ameen Rihani Organization","Moise A. Khayrallah Center for Lebanese Diaspora Studies",,,"Donor retains full ownership of any and all copyright currently controlled in agreement with Khayrallah Center. Nonexclusive right to authorize all uses of these materials for non-commercial research, scholarly, or other educational purposes are granted to Khayrallah Center pursuant to Creative Commons Attribution-NonCommercial-ShareAlike (CC BY-NC-SA).",,Text/pdf,"English ",Text,Rihani2019AR24_091,"Oak Park, Illinois",,,,,,,,,,,,,,,,,,,,,,,,,,,,,,,,,,,,,,,,,,,,,,,,,,,,,,,,,,,,,,,,,,,,,,,,,,,,,"Grace Dickinson Sperling,Martin Sprengling,Oriental Institute,University of Chicago",https://lebanesestudies.omeka.chass.ncsu.edu/files/original/4f2a3de3d6980ace664033735e8120d7.pdf,,"Ameen Rihani: English Letters",1,0
43025,https://lebanesestudies.omeka.chass.ncsu.edu/items/show/43025,,,,,,,,,,,,,,,,,,,,,,,,,,,,,,,,,,,,,,,,,"Letter from Martin Sprengling to Ameen Rihani, 1935 July 10","Letter writing, English^^Correspondence^^ American literature--Arab American authors^^ Rihani, Ameen Fares, 1876-1940","A letter from Martin Sprengling to Ameen Rihani, dated July 10, 1935.","University of Chicago^^Martin Sprengling ","Ameen Rihani Organization","Moise A. Khayrallah Center for Lebanese Diaspora Studies",1935-07-10,,"Donor retains full ownership of any and all copyright currently controlled in agreement with Khayrallah Center. Nonexclusive right to authorize all uses of these materials for non-commercial research, scholarly, or other educational purposes are granted to Khayrallah Center pursuant to Creative Commons Attribution-NonCommercial-ShareAlike (CC BY-NC-SA).",,Text/pdf,"English ",Text,Rihani2019AR24_019,"Chicago, Illinois",,,,,,,,,,,,,,,,,,,,,,,,,,,,,,,,,,,,,,,,,,,,,,,,,,,,,,,,,,,,,,,,,,,,,,,,,,,,,"1930's,Martin Sprengling,Oriental Institute,University of Chicago",https://lebanesestudies.omeka.chass.ncsu.edu/files/original/fbe8e957973cf49cb2ad9cf978f5670a.pdf,,"Ameen Rihani: English Letters",1,0
43026,https://lebanesestudies.omeka.chass.ncsu.edu/items/show/43026,,,,,,,,,,,,,,,,,,,,,,,,,,,,,,,,,,,,,,,,,"Letter from Martin Sprengling to Ameen Rihani, 1935 April 30","Letter writing, English^^Correspondence^^ American literature--Arab American authors^^ Rihani, Ameen Fares, 1876-1940","A letter from Martin Sprenglng to Ameen Rihani, dated April 30, 1935.","University of Chicago^^Martin Sprengling ","Ameen Rihani Organization","Moise A. Khayrallah Center for Lebanese Diaspora Studies",1935-04-30,,"Donor retains full ownership of any and all copyright currently controlled in agreement with Khayrallah Center. Nonexclusive right to authorize all uses of these materials for non-commercial research, scholarly, or other educational purposes are granted to Khayrallah Center pursuant to Creative Commons Attribution-NonCommercial-ShareAlike (CC BY-NC-SA).",,Text/pdf,"English ",Text,Rihani2019AR24_018,"Chicago, Illinois",,,,,,,,,,,,,,,,,,,,,,,,,,,,,,,,,,,,,,,,,,,,,,,,,,,,,,,,,,,,,,,,,,,,,,,,,,,,,"1930's,Martin Sprengling,Oriental Institute,University of Chicago",https://lebanesestudies.omeka.chass.ncsu.edu/files/original/26d80a48d8bfd6b61edfa5c422b53257.pdf,,"Ameen Rihani: English Letters",1,0
43027,https://lebanesestudies.omeka.chass.ncsu.edu/items/show/43027,,,,,,,,,,,,,,,,,,,,,,,,,,,,,,,,,,,,,,,,,"Letter from Martin Sprengling to Ameen Rihani, 1933 February 16","Letter writing, English^^Correspondence^^ American literature--Arab American authors^^ Rihani, Ameen Fares, 1876-1940","A letter from Martin Sprengling to Ameen Rihani, dated February 16, 1933.","University of Chicago^^Martin Sprengling ","Ameen Rihani Organization","Moise A. Khayrallah Center for Lebanese Diaspora Studies",1933-02-16,,"Donor retains full ownership of any and all copyright currently controlled in agreement with Khayrallah Center. Nonexclusive right to authorize all uses of these materials for non-commercial research, scholarly, or other educational purposes are granted to Khayrallah Center pursuant to Creative Commons Attribution-NonCommercial-ShareAlike (CC BY-NC-SA).",,Text/pdf,"English ",Text,Rihani2019AR24_017,"Chicago, Illinois",,,,,,,,,,,,,,,,,,,,,,,,,,,,,,,,,,,,,,,,,,,,,,,,,,,,,,,,,,,,,,,,,,,,,,,,,,,,,"1930's,Martin Sprengling,Oriental Institute,University of Chicago",https://lebanesestudies.omeka.chass.ncsu.edu/files/original/8f925a5dfa8724cbed95adcee313ff8e.pdf,,"Ameen Rihani: English Letters",1,0
43028,https://lebanesestudies.omeka.chass.ncsu.edu/items/show/43028,,,,,,,,,,,,,,,,,,,,,,,,,,,,,,,,,,,,,,,,,"Letter from Martin Sprengling to Ameen Rihani, 1932 October 4","Letter writing, English^^Correspondence^^ American literature--Arab American authors^^ Rihani, Ameen Fares, 1876-1940","A letter from Martin Sprengling to Ameen Rihani, dated October 4, 1932.","University of Chicago^^Martin Sprengling ","Ameen Rihani Organization","Moise A. Khayrallah Center for Lebanese Diaspora Studies",1932-10-04,,"Donor retains full ownership of any and all copyright currently controlled in agreement with Khayrallah Center. Nonexclusive right to authorize all uses of these materials for non-commercial research, scholarly, or other educational purposes are granted to Khayrallah Center pursuant to Creative Commons Attribution-NonCommercial-ShareAlike (CC BY-NC-SA).",,Text/pdf,"English ",Text,Rihani2019AR24_016,"Chicago, Illinois",,,,,,,,,,,,,,,,,,,,,,,,,,,,,,,,,,,,,,,,,,,,,,,,,,,,,,,,,,,,,,,,,,,,,,,,,,,,,"1930's,Martin Sprengling,Oriental Institute,University of Chicago",https://lebanesestudies.omeka.chass.ncsu.edu/files/original/c80cbd6c54168a2c15f0b3d9062af525.pdf,,"Ameen Rihani: English Letters",1,0
43029,https://lebanesestudies.omeka.chass.ncsu.edu/items/show/43029,,,,,,,,,,,,,,,,,,,,,,,,,,,,,,,,,,,,,,,,,"Letter from Martin Sprengling to Ameen Rihani, 1931 August 24","Letter writing, English^^Correspondence^^ American literature--Arab American authors^^ Rihani, Ameen Fares, 1876-1940","A letter from Martin Sprengling to Ameen Rihani, dated August 24, 1931.","University of Chicago^^Martin Sprengling ","Ameen Rihani Organization","Moise A. Khayrallah Center for Lebanese Diaspora Studies",1931-08-24,,"Donor retains full ownership of any and all copyright currently controlled in agreement with Khayrallah Center. Nonexclusive right to authorize all uses of these materials for non-commercial research, scholarly, or other educational purposes are granted to Khayrallah Center pursuant to Creative Commons Attribution-NonCommercial-ShareAlike (CC BY-NC-SA).",,Text/pdf,"English ",Text,Rihani2019AR24_015,"Chicago, Illinois",,,,,,,,,,,,,,,,,,,,,,,,,,,,,,,,,,,,,,,,,,,,,,,,,,,,,,,,,,,,,,,,,,,,,,,,,,,,,"1930's,Martin Sprengling,Oriental Institute,University of Chicago",https://lebanesestudies.omeka.chass.ncsu.edu/files/original/af200e2bf1e6a980c9e453cd4a97fa78.pdf,,"Ameen Rihani: English Letters",1,0
43030,https://lebanesestudies.omeka.chass.ncsu.edu/items/show/43030,,,,,,,,,,,,,,,,,,,,,,,,,,,,,,,,,,,,,,,,,"Letter from Martin Sprengling to Ameen Rihani, 1929 October 14","Letter writing, English^^Correspondence^^ American literature--Arab American authors^^ Rihani, Ameen Fares, 1876-1940","A letter from Martin Sprengling to Ameen Rihani, dated October 14, 1929.","University of Chicago^^Martin Sprengling ","Ameen Rihani Organization","Moise A. Khayrallah Center for Lebanese Diaspora Studies",1929-10-14,,"Donor retains full ownership of any and all copyright currently controlled in agreement with Khayrallah Center. Nonexclusive right to authorize all uses of these materials for non-commercial research, scholarly, or other educational purposes are granted to Khayrallah Center pursuant to Creative Commons Attribution-NonCommercial-ShareAlike (CC BY-NC-SA).",,Text/pdf,English,Text,Rihani2019AR24_014,"Chicago, Illinois",,,,,,,,,,,,,,,,,,,,,,,,,,,,,,,,,,,,,,,,,,,,,,,,,,,,,,,,,,,,,,,,,,,,,,,,,,,,,"1920's,Martin Sprengling,Oriental Institute,University of Chicago",https://lebanesestudies.omeka.chass.ncsu.edu/files/original/b9d33779ac90f367809fadf518aaabbd.pdf,,"Ameen Rihani: English Letters",1,0
43150,https://lebanesestudies.omeka.chass.ncsu.edu/items/show/43150,,,,,,,,,,,,,,,,,,,,,,,,,,,,,,,,,,,,,,,,,"Letter (incomplete) from The Oriental Institute to Ameen Rihani, 1932 February 13","Letter writing, English^^Correspondence^^ American literature--Arab American authors^^ Rihani, Ameen Fares, 1876-1940","A letter (incomplete) from the Oriental Institute to Ameen Rihani, dated February 13, 1932.","The Oriental Institute ","Ameen Rihani Organization","Moise A. Khayrallah Center for Lebanese Diaspora Studies",1932-02-13,,"Donor retains full ownership of any and all copyright currently controlled in agreement with Khayrallah Center. Nonexclusive right to authorize all uses of these materials for non-commercial research, scholarly, or other educational purposes are granted to Khayrallah Center pursuant to Creative Commons Attribution-NonCommercial-ShareAlike (CC BY-NC-SA).",,Text/pdf,"English ",Text,Rihani2019AR22_N_095,"Chicago, Illinois",,,,,,,,,,,,,,,,,,,,,,,,,,,,,,,,,,,,,,,,,,,,,,,,,,,,,,,,,,,,,,,,,,,,,,,,,,,,,"1930's,Oriental Institute,University of Chicago",https://lebanesestudies.omeka.chass.ncsu.edu/files/original/dd14a459eea37194abb724476c8fbedb.pdf,,"Ameen Rihani: English Letters",1,0
