﻿"Item Id","Item URI","Dublin Core:Alternative Title","Dublin Core:Abstract","Dublin Core:Table Of Contents","Dublin Core:Date Available","Dublin Core:Date Created","Dublin Core:Date Accepted","Dublin Core:Date Copyrighted","Dublin Core:Date Submitted","Dublin Core:Date Issued","Dublin Core:Date Modified","Dublin Core:Date Valid","Dublin Core:Access Rights","Dublin Core:License","Dublin Core:Conforms To","Dublin Core:Has Format","Dublin Core:Has Part","Dublin Core:Has Version","Dublin Core:Is Format Of","Dublin Core:Is Part Of","Dublin Core:Is Referenced By","Dublin Core:Is Replaced By","Dublin Core:Is Required By","Dublin Core:Is Version Of","Dublin Core:References","Dublin Core:Replaces","Dublin Core:Requires","Dublin Core:Extent","Dublin Core:Medium","Dublin Core:Bibliographic Citation","Dublin Core:Spatial Coverage","Dublin Core:Temporal Coverage","Dublin Core:Accrual Method","Dublin Core:Accrual Periodicity","Dublin Core:Accrual Policy","Dublin Core:Audience","Dublin Core:Audience Education Level","Dublin Core:Mediator","Dublin Core:Instructional Method","Dublin Core:Provenance","Dublin Core:Rights Holder","Dublin Core:Title","Dublin Core:Subject","Dublin Core:Description","Dublin Core:Creator","Dublin Core:Source","Dublin Core:Publisher","Dublin Core:Date","Dublin Core:Contributor","Dublin Core:Rights","Dublin Core:Relation","Dublin Core:Format","Dublin Core:Language","Dublin Core:Type","Dublin Core:Identifier","Dublin Core:Coverage","Item Type Metadata:Text","Item Type Metadata:Interviewer","Item Type Metadata:Interviewee","Item Type Metadata:Location","Item Type Metadata:Transcription","Item Type Metadata:Local URL","Item Type Metadata:Original Format","Item Type Metadata:Physical Dimensions","Item Type Metadata:Duration","Item Type Metadata:Compression","Item Type Metadata:Producer","Item Type Metadata:Director","Item Type Metadata:Bit Rate/Frequency","Item Type Metadata:Time Summary","Item Type Metadata:Email Body","Item Type Metadata:Subject Line","Item Type Metadata:From","Item Type Metadata:To","Item Type Metadata:CC","Item Type Metadata:BCC","Item Type Metadata:Number of Attachments","Item Type Metadata:Standards","Item Type Metadata:Objectives","Item Type Metadata:Materials","Item Type Metadata:Lesson Plan Text","Item Type Metadata:URL","Item Type Metadata:Event Type","Item Type Metadata:Participants","Item Type Metadata:Birth Date","Item Type Metadata:Birthplace","Item Type Metadata:Death Date","Item Type Metadata:Occupation","Item Type Metadata:Biographical Text","Item Type Metadata:Bibliography","Item Type Metadata:First Name (English)","Item Type Metadata:Last Name (English)","Item Type Metadata:Address","Item Type Metadata:City","Item Type Metadata:State","Item Type Metadata:Business (English)","Item Type Metadata:Provenance (English)","Item Type Metadata:Provenance (Arabic)","Item Type Metadata:Business (Arabic)","Item Type Metadata:Last Name (Arabic)","Item Type Metadata:First Name (Arabic)","Item Type Metadata:Player","Omeka Legacy File:Additional Creator","Omeka Legacy File:Transcriber","Omeka Legacy File:Producer","Omeka Legacy File:Render Device","Omeka Legacy File:Render Details","Omeka Legacy File:Capture Date","Omeka Legacy File:Capture Device","Omeka Legacy File:Capture Details","Omeka Legacy File:Change History","Omeka Legacy File:Watermark","Omeka Legacy File:Encryption","Omeka Legacy File:Compression","Omeka Legacy File:Post Processing","Omeka Image File:Width","Omeka Image File:Height","Omeka Image File:Bit Depth","Omeka Image File:Channels","Omeka Image File:Exif String","Omeka Image File:Exif Array","Omeka Image File:IPTC String","Omeka Image File:IPTC Array","Omeka Video File:Bitrate","Omeka Video File:Duration","Omeka Video File:Sample Rate","Omeka Video File:Codec","Omeka Video File:Width","Omeka Video File:Height","PDF Text:Text","Users Elements:Test","Test Elements:Test",tags,file,itemType,collection,public,featured
974,https://lebanesestudies.omeka.chass.ncsu.edu/items/show/974,,,,,,,,,,,,,,,,,,,,,,,,,,,,,,,,,,,,,,,,,"""...Precina Joreple, an Assyrian woman, was charged with disorderly conduct..."" 1899",,,"The Wilmington Messenger","Special Collections Department, North Carolina Room, New Hanover County Public Library, Wilmington, North Carolina","The Wilmington Messenger^^Moise A. Khayrallah Center for Lebanese Diaspora Studies","April 22, 1899",,"Donor retains full ownership of any and all copyright currently controlled in agreement with Khayrallah Center. Nonexclusive right to authorize all uses of these materials for non-commercial research, scholarly, or other educational purposes are granted to Khayrallah Center pursuant to Creative Commons Attribution-NonCommercial-ShareAlike (CC BY-NC-SA).",,,English,,,,,,,,,,,,,,,,,,,,,,,,,,,,,,,,,,,,,,,,,,,,,,,,,,,,,,,,,,,,,,,,,,,,,,,,,,,,,,,,"1890's,Assyrian,Crime,Newspapers,Newspapers-Wilmington,North Carolina,Wilmington, North Carolina",https://lebanesestudies.omeka.chass.ncsu.edu/files/original/69e93ac668888b79e1d998ad3ab63b3e.jpg,Newspaper,"North Carolina Newspapers",1,1
977,https://lebanesestudies.omeka.chass.ncsu.edu/items/show/977,,,,,,,,,,,,,,,,,,,,,,,,,,,,,,,,,,,,,,,,,"""...the Syrian merchant, Kalila, who threw a pair of shoes at a departing customer, was discharged..."" 1902",,,"The Morning Star","Special Collections Department, North Carolina Room, New Hanover County Public Library, Wilmington, North Carolina","""The Morning Star""^^Moise A. Khayrallah Center for Lebanese Diaspora Studies","April 4, 1902",,"Donor retains full ownership of any and all copyright currently controlled in agreement with Khayrallah Center. Nonexclusive right to authorize all uses of these materials for non-commercial research, scholarly, or other educational purposes are granted to Khayrallah Center pursuant to Creative Commons Attribution-NonCommercial-ShareAlike (CC BY-NC-SA).",,,English,,,,,,,,,,,,,,,,,,,,,,,,,,,,,,,,,,,,,,,,,,,,,,,,,,,,,,,,,,,,,,,,,,,,,,,,,,,,,,,,"1900's,Crime,Diabe Kalille,Kalille,Merchant,Newspapers,Newspapers-Wilmington,North Carolina,Syrian,Wilmington, North Carolina",https://lebanesestudies.omeka.chass.ncsu.edu/files/original/d4d6db044307bf85360f5fcfa3676be4.jpg,Newspaper,"North Carolina Newspapers",1,1
911,https://lebanesestudies.omeka.chass.ncsu.edu/items/show/911,,,,,,,,,,,,,,,,,,,,,,,,,,,,,,,,,,,,,,,,,"""A fresh detachment of Syrians arrived in the city today."" 1900",,,"The News Dispatch","Special Collections Department, North Carolina Room, New Hanover County Public Library, Wilmington, North Carolina","""The News Dispatch""^^Moise A. Khayrallah Center for Lebanese Diaspora Studies","February 9, 1900",,"Donor retains full ownership of any and all copyright currently controlled in agreement with Khayrallah Center. Nonexclusive right to authorize all uses of these materials for non-commercial research, scholarly, or other educational purposes are granted to Khayrallah Center pursuant to Creative Commons Attribution-NonCommercial-ShareAlike (CC BY-NC-SA).",,,English,,,,,,,,,,,,,,,,,,,,,,,,,,,,,,,,,,,,,,,,,,,,,,,,,,,,,,,,,,,,,,,,,,,,,,,,,,,,,,,,"1900's,Immigrants,Newspapers,Newspapers-Wilmington,North Carolina,Syrian,Wilmington, North Carolina",https://lebanesestudies.omeka.chass.ncsu.edu/files/original/e22e8bc91c3cac404851a6a9c6f10211.jpg,Newspaper,"North Carolina Newspapers",1,1
954,https://lebanesestudies.omeka.chass.ncsu.edu/items/show/954,,,,,,,,,,,,,,,,,,,,,,,,,,,,,,,,,,,,,,,,,"""A Host of Syrians"" 1897",,,"The Morning Star","Special Collections Department, North Carolina Room, New Hanover County Public Library, Wilmington, North Carolina","""The Morning Star""^^Moise A. Khayrallah Center for Lebanese Diaspora Studies","June 15, 1897",,"Donor retains full ownership of any and all copyright currently controlled in agreement with Khayrallah Center. Nonexclusive right to authorize all uses of these materials for non-commercial research, scholarly, or other educational purposes are granted to Khayrallah Center pursuant to Creative Commons Attribution-NonCommercial-ShareAlike (CC BY-NC-SA).",,,English,,,,,,,,,,,,,,,,,,,,,,,,,,,,,,,,,,,,,,,,,,,,,,,,,,,,,,,,,,,,,,,,,,,,,,,,,,,,,,,,"1890's,Catholicism,Immigrants,Newspapers,Newspapers-Wilmington,North Carolina,Priests,Syrian,Trains,Wilmington, North Carolina",https://lebanesestudies.omeka.chass.ncsu.edu/files/original/605d992b8bef932dfbc9a5cb1b55bdb2.jpg,Newspaper,"North Carolina Newspapers",1,1
78440,https://lebanesestudies.omeka.chass.ncsu.edu/items/show/78440,,,,,,,,,,,,,,,,,,,,,,,,,,,,,,,,,,,,,,,,,"""A Love Affair with Tryon Palace"" Article","Newspapers^^ Lebanese--United States","An article about Joseph Zaytoun's continuing leadership with the historic Tryon Palace in New Bern and past accomplishments. ","Suzy Brett","Stephen Zaytoun","Moise A. Khayrallah Center for Lebanese Diaspora Studies",1991,,"The donor retains full ownership of any copyright and rights currently controlled. Nonexclusive right to authorize uses of these materials for non-commercial research, scholarly, or other educational purposes are granted to Khayrallah Center pursuant to U.S. Copyright Law. Usage of the materials for these purposes must be fully credited with the source. The user assumes full responsibility for any use of the materials.",,Text/pdf,English,Text,kc0030_001,,,,,,,,,,,,,,,,,,,,,,,,,,,,,,,,,,,,,,,,,,,,,,,,,,,,,,,,,,,,,,,,,,,,,,,,,,,,,,"1990s,Newspapers,North Carolina",https://lebanesestudies.omeka.chass.ncsu.edu/files/original/4537b651b290df85e28c94dfef318100.pdf,,"Joseph and Thelma Knuckley Zaytoun Papers",1,0
78002,https://lebanesestudies.omeka.chass.ncsu.edu/items/show/78002,,,,,,,,,,,,,,,,,,,,,,,,,,,,,,,,,,,,,,,,,"""A New Director, New Directions,"" <em>We the People of North Carolina Magazine</em>","Lebanese--United States","Article on Domit's role as Director, North Carolina Museum of Art. Entitled ""A New Director, New Directions."" The article touches upon the controversy surrounding the museum's move, but emphasizes Domit's role in growing the collection.","We the People of North Carolina Magazine","Moussa Domit","Moise A. Khayrallah Center for Lebanese Diaspora Studies","1974 Sept",,"The donor retains full ownership of any copyright and rights currently controlled. Nonexclusive right to authorize uses of these materials for non-commercial research, scholarly, or other educational purposes are granted to Khayrallah Center pursuant to U.S. Copyright Law. Usage of the materials for these purposes must be fully credited with the source. The user assumes full responsibility for any use of the materials.",,Text/pdf,English,Text,kc0022_019,,,,,,,,,,,,,,,,,,,,,,,,,,,,,,,,,,,,,,,,,,,,,,,,,,,,,,,,,,,,,,,,,,,,,,,,,,,,,,"1970s,Art,North Carolina",https://lebanesestudies.omeka.chass.ncsu.edu/files/original/8f441a5c44ab28733bb3618c0ddb7259.pdf,,"Domit Family Papers",1,0
953,https://lebanesestudies.omeka.chass.ncsu.edu/items/show/953,,,,,,,,,,,,,,,,,,,,,,,,,,,,,,,,,,,,,,,,,"""A party of about twenty Syrians arrived here yesterday."" 1897",,,"The News Dispatch","Special Collections Department, North Carolina Room, New Hanover County Public Library, Wilmington, North Carolina","""The News Dispatch""^^Moise A. Khayrallah Center for Lebanese Diaspora Studies","June 15, 1897",,"Donor retains full ownership of any and all copyright currently controlled in agreement with Khayrallah Center. Nonexclusive right to authorize all uses of these materials for non-commercial research, scholarly, or other educational purposes are granted to Khayrallah Center pursuant to Creative Commons Attribution-NonCommercial-ShareAlike (CC BY-NC-SA).",,,English,,,,,,,,,,,,,,,,,,,,,,,,,,,,,,,,,,,,,,,,,,,,,,,,,,,,,,,,,,,,,,,,,,,,,,,,,,,,,,,,"1890's,Catholicism,Immigrants,Newspapers,Newspapers-Wilmington,North Carolina,Priests,Religion,Syrian,Wilmington, North Carolina",https://lebanesestudies.omeka.chass.ncsu.edu/files/original/3860b6b83ecfb6f0bf852ed279a7bd4f.jpg,Newspaper,"North Carolina Newspapers",1,1
983,https://lebanesestudies.omeka.chass.ncsu.edu/items/show/983,,,,,,,,,,,,,,,,,,,,,,,,,,,,,,,,,,,,,,,,,"""A Syrian In Trouble. Michael Kourani Charged With Embezzlement, Arrested by Detective Green."" 1900",,,"The Morning Star","Special Collections Department, North Carolina Room, New Hanover County Public Library, Wilmington, North Carolina","""The Morning Star""^^Moise A. Khayrallah Center for Lebanese Diaspora Studies","December 14, 1900",,"Donor retains full ownership of any and all copyright currently controlled in agreement with Khayrallah Center. Nonexclusive right to authorize all uses of these materials for non-commercial research, scholarly, or other educational purposes are granted to Khayrallah Center pursuant to Creative Commons Attribution-NonCommercial-ShareAlike (CC BY-NC-SA).",,,English,,,,,,,,,,,,,,,,,,,,,,,,,,,,,,,,,,,,,,,,,,,,,,,,,,,,,,,,,,,,,,,,,,,,,,,,,,,,,,,,"1900's,Businesses,Crime,Kourani,Michael Kourani,Nageeb Kourani,Newspapers,Newspapers-Wilmington,North Carolina,Syrian,Wilmington, North Carolina",https://lebanesestudies.omeka.chass.ncsu.edu/files/original/67a0ed05629fde613c4bad68b401d481.jpg,Newspaper,"North Carolina Newspapers",1,1
1012,https://lebanesestudies.omeka.chass.ncsu.edu/items/show/1012,,,,,,,,,,,,,,,,,,,,,,,,,,,,,,,,,,,,,,,,,"""A Syrian Merchant Arrested...betrayal of a girl..."" 1897",,,"Wilmington Newspaper","Special Collections Department, North Carolina Room, New Hanover County Public Library, Wilmington, North Carolina","Moise A. Khayrallah Center for Lebanese Diaspora Studies",1897,,"Donor retains full ownership of any and all copyright currently controlled in agreement with Khayrallah Center. Nonexclusive right to authorize all uses of these materials for non-commercial research, scholarly, or other educational purposes are granted to Khayrallah Center pursuant to Creative Commons Attribution-NonCommercial-ShareAlike (CC BY-NC-SA).",,,English,,,,,,,,,,,,,,,,,,,,,,,,,,,,,,,,,,,,,,,,,,,,,,,,,,,,,,,,,,,,,,,,,,,,,,,,,,,,,,,,"1890's,Law,Merchant,Newspapers,Newspapers-Wilmington,Nockley Schrohid,North Carolina,Schrohid,Syrian,Wilmington, North Carolina",https://lebanesestudies.omeka.chass.ncsu.edu/files/original/4aa7bc526b2fde901c50eaf3e95f29b9.jpg,Newspaper,"North Carolina Newspapers",1,1
979,https://lebanesestudies.omeka.chass.ncsu.edu/items/show/979,,,,,,,,,,,,,,,,,,,,,,,,,,,,,,,,,,,,,,,,,"""A Syrian Merchant's Way."" 1902",,,"The Morning Star","Special Collections Department, North Carolina Room, New Hanover County Public Library, Wilmington, North Carolina","""The Morning Star""^^Moise A. Khayrallah Center for Lebanese Diaspora Studies","April 3, 1902",,"Donor retains full ownership of any and all copyright currently controlled in agreement with Khayrallah Center. Nonexclusive right to authorize all uses of these materials for non-commercial research, scholarly, or other educational purposes are granted to Khayrallah Center pursuant to Creative Commons Attribution-NonCommercial-ShareAlike (CC BY-NC-SA).",,,English,,,,,,,,,,,,,,,,,,,,,,,,,,,,,,,,,,,,,,,,,,,,,,,,,,,,,,,,,,,,,,,,,,,,,,,,,,,,,,,,"1900's,Businesses,Crime,Diabe Kalille,Kalille,Merchant,Newspapers,Newspapers-Wilmington,North Carolina,Race,Store,Syrian,Wilmington, North Carolina",https://lebanesestudies.omeka.chass.ncsu.edu/files/original/91498ac70a112e4ab95e90f53a163ad8.jpg,Newspaper,"North Carolina Newspapers",1,1
1013,https://lebanesestudies.omeka.chass.ncsu.edu/items/show/1013,,,,,,,,,,,,,,,,,,,,,,,,,,,,,,,,,,,,,,,,,"""A Syrian Wedding. Nackley Scraehid...was married...to Miss Mary Gideon..."" 1897",,,"The Wilmington Messenger","Special Collections Department, North Carolina Room, New Hanover County Public Library, Wilmington, North Carolina","Moise A. Khayrallah Center for Lebanese Diaspora Studies^^Moise A. Khayrallah Center for Lebanese Diaspora Studies","February 3, 1897",,"Donor retains full ownership of any and all copyright currently controlled in agreement with Khayrallah Center. Nonexclusive right to authorize all uses of these materials for non-commercial research, scholarly, or other educational purposes are granted to Khayrallah Center pursuant to Creative Commons Attribution-NonCommercial-ShareAlike (CC BY-NC-SA).",,Image/jpg,English,Text,,,,,,,,,,,,,,,,,,,,,,,,,,,,,,,,,,,,,,,,,,,,,,,,,,,,,,,,,,,,,,,,,,,,,,,,,,,,,,,"1890's,Charleston, South Carolina,Gideon,Marriages,Mary Gideon,Nackley Scraehid,Newspapers,Newspapers-Wilmington,Nockley Schrohid,North Carolina,Schrohid,Scraehid,South Carolina,St. Thomas Catholic Church Wilmington,Wilmington, North Carolina",https://lebanesestudies.omeka.chass.ncsu.edu/files/original/d6403ae1185ece527e48f43b886dcdd1.jpg,Newspaper,"North Carolina Newspapers",1,1
925,https://lebanesestudies.omeka.chass.ncsu.edu/items/show/925,,,,,,,,,,,,,,,,,,,,,,,,,,,,,,,,,,,,,,,,,"""A Syrian, H. Abdella, was tried by Justice Fowler yesterday for larceny by trick."" 1899",,,"The Wilmington Messenger","Special Collections Department, North Carolina Room, New Hanover County Public Library, Wilmington, North Carolina","The Wilmington Messenger^^Moise A. Khayrallah Center for Lebanese Diaspora Studies","June 29, 1899",,"Donor retains full ownership of any and all copyright currently controlled in agreement with Khayrallah Center. Nonexclusive right to authorize all uses of these materials for non-commercial research, scholarly, or other educational purposes are granted to Khayrallah Center pursuant to Creative Commons Attribution-NonCommercial-ShareAlike (CC BY-NC-SA).",,,English,,,,,,,,,,,,,,,,,,,,,,,,,,,,,,,,,,,,,,,,,,,,,,,,,,,,,,,,,,,,,,,,,,,,,,,,,,,,,,,,"1890's,Crime,Newspapers,Newspapers-Wilmington,North Carolina,Wilmington, North Carolina",https://lebanesestudies.omeka.chass.ncsu.edu/files/original/23b14df8946b6519a88340ee9c092175.jpg,Newspaper,"North Carolina Newspapers",1,1
947,https://lebanesestudies.omeka.chass.ncsu.edu/items/show/947,,,,,,,,,,,,,,,,,,,,,,,,,,,,,,,,,,,,,,,,,"""A Syrian, Henry Dielepop, was tried in the police court..."" 1899",,,"The Wilmington Messenger","Special Collections Department, North Carolina Room, New Hanover County Public Library, Wilmington, North Carolina","The Wilmington Messenger^^Moise A. Khayrallah Center for Lebanese Diaspora Studies","June 15, 1899",,"Donor retains full ownership of any and all copyright currently controlled in agreement with Khayrallah Center. Nonexclusive right to authorize all uses of these materials for non-commercial research, scholarly, or other educational purposes are granted to Khayrallah Center pursuant to Creative Commons Attribution-NonCommercial-ShareAlike (CC BY-NC-SA).",,,English,,,,,,,,,,,,,,,,,,,,,,,,,,,,,,,,,,,,,,,,,,,,,,,,,,,,,,,,,,,,,,,,,,,,,,,,,,,,,,,,"1890's,Crime,Newspapers,Newspapers-Wilmington,North Carolina,Syrian,Wilmington, North Carolina",https://lebanesestudies.omeka.chass.ncsu.edu/files/original/44dba15ab56006fc3211073543d8b083.jpg,Newspaper,"North Carolina Newspapers",1,1
1019,https://lebanesestudies.omeka.chass.ncsu.edu/items/show/1019,,,,,,,,,,,,,,,,,,,,,,,,,,,,,,,,,,,,,,,,,"""About A Pair Of Pants. A Trial in which an Assyrian and an African Figured."" 1899",,,"The News Dispatch","Special Collections Department, North Carolina Room, New Hanover County Public Library, Wilmington, North Carolina","""The News Dispatch""^^Moise A. Khayrallah Center for Lebanese Diaspora Studies","July 18, 1899",,"Donor retains full ownership of any and all copyright currently controlled in agreement with Khayrallah Center. Nonexclusive right to authorize all uses of these materials for non-commercial research, scholarly, or other educational purposes are granted to Khayrallah Center pursuant to Creative Commons Attribution-NonCommercial-ShareAlike (CC BY-NC-SA).",,,English,,,,,,,,,,,,,,,,,,,,,,,,,,,,,,,,,,,,,,,,,,,,,,,,,,,,,,,,,,,,,,,,,,,,,,,,,,,,,,,,"1890's,Law,Newspapers,Newspapers-Wilmington,North Carolina,Race,Shibley,Wilmington, North Carolina",https://lebanesestudies.omeka.chass.ncsu.edu/files/original/6dc46b7979b13bcb678ccaf53ab47cad.jpg,Newspaper,"North Carolina Newspapers",1,1
981,https://lebanesestudies.omeka.chass.ncsu.edu/items/show/981,,,,,,,,,,,,,,,,,,,,,,,,,,,,,,,,,,,,,,,,,"""An Asyrian Mix-Up. A Live Fight on Market Street Yesterday in Which Five Asyrians Participated."" 1905",,,"The Wilmington Messenger","Special Collections Department, North Carolina Room, New Hanover County Public Library, Wilmington, North Carolina","The Wilmington Messenger^^Moise A. Khayrallah Center for Lebanese Diaspora Studies","October 10, 1905",,"Donor retains full ownership of any and all copyright currently controlled in agreement with Khayrallah Center. Nonexclusive right to authorize all uses of these materials for non-commercial research, scholarly, or other educational purposes are granted to Khayrallah Center pursuant to Creative Commons Attribution-NonCommercial-ShareAlike (CC BY-NC-SA).",,,English,,,,,,,,,,,,,,,,,,,,,,,,,,,,,,,,,,,,,,,,,,,,,,,,,,,,,,,,,,,,,,,,,,,,,,,,,,,,,,,,"1900's,Arabic,Assyrian,Crime,Diabe Kalille,Kalille,Language,Newspapers,Newspapers-Wilmington,North Carolina,Simon,Wilmington, North Carolina",https://lebanesestudies.omeka.chass.ncsu.edu/files/original/f8bb20e485aedaad1308249e860fea70.jpg,Newspaper,"North Carolina Newspapers",1,1
1002,https://lebanesestudies.omeka.chass.ncsu.edu/items/show/1002,,,,,,,,,,,,,,,,,,,,,,,,,,,,,,,,,,,,,,,,,"""An Incorrigible Syrian. Son of Orient Before Mayor in Police Court--Reckless Driving."" 1907",,,"The Morning Star","Special Collections Department, North Carolina Room, New Hanover County Public Library, Wilmington, North Carolina","""The Morning Star""^^Moise A. Khayrallah Center for Lebanese Diaspora Studies","August 23, 1907",,"Donor retains full ownership of any and all copyright currently controlled in agreement with Khayrallah Center. Nonexclusive right to authorize all uses of these materials for non-commercial research, scholarly, or other educational purposes are granted to Khayrallah Center pursuant to Creative Commons Attribution-NonCommercial-ShareAlike (CC BY-NC-SA).",,,English,,,,,,,,,,,,,,,,,,,,,,,,,,,,,,,,,,,,,,,,,,,,,,,,,,,,,,,,,,,,,,,,,,,,,,,,,,,,,,,,"1900's,Law,Newspapers,Newspapers-Wilmington,North Carolina,Rabil,Syrian,Wilmington, North Carolina",https://lebanesestudies.omeka.chass.ncsu.edu/files/original/ff61bf97bcc1626c75bebb523ae95fd9.jpg,Newspaper,"North Carolina Newspapers",1,1
998,https://lebanesestudies.omeka.chass.ncsu.edu/items/show/998,,,,,,,,,,,,,,,,,,,,,,,,,,,,,,,,,,,,,,,,,"""An Interesting Entertainment. Rev. Faddhul Moghabghab...will deliver a lecture..."" 1894",,,"The Wilmington Messenger","Special Collections Department, North Carolina Room, New Hanover County Public Library, Wilmington, North Carolina","The Wilmington Messenger^^Moise A. Khayrallah Center for Lebanese Diaspora Studies","December 14, 1894",,"Donor retains full ownership of any and all copyright currently controlled in agreement with Khayrallah Center. Nonexclusive right to authorize all uses of these materials for non-commercial research, scholarly, or other educational purposes are granted to Khayrallah Center pursuant to Creative Commons Attribution-NonCommercial-ShareAlike (CC BY-NC-SA).",,,English,,,,,,,,,,,,,,,,,,,,,,,,,,,,,,,,,,,,,,,,,,,,,,,,,,,,,,,,,,,,,,,,,,,,,,,,,,,,,,,,"1890's,American College Beirut,Beirut, Lebanon,Faddhul Moghabghab,Moghabghab,Mount Lebanon,Newspapers,Newspapers-Wilmington,North Carolina,Religion,Syrian,Wilmington, North Carolina",https://lebanesestudies.omeka.chass.ncsu.edu/files/original/65539c215f85b10f6bb27480d1e54f00.jpg,Newspaper,"North Carolina Newspapers",1,1