﻿"Item Id","Item URI","Dublin Core:Alternative Title","Dublin Core:Abstract","Dublin Core:Table Of Contents","Dublin Core:Date Available","Dublin Core:Date Created","Dublin Core:Date Accepted","Dublin Core:Date Copyrighted","Dublin Core:Date Submitted","Dublin Core:Date Issued","Dublin Core:Date Modified","Dublin Core:Date Valid","Dublin Core:Access Rights","Dublin Core:License","Dublin Core:Conforms To","Dublin Core:Has Format","Dublin Core:Has Part","Dublin Core:Has Version","Dublin Core:Is Format Of","Dublin Core:Is Part Of","Dublin Core:Is Referenced By","Dublin Core:Is Replaced By","Dublin Core:Is Required By","Dublin Core:Is Version Of","Dublin Core:References","Dublin Core:Replaces","Dublin Core:Requires","Dublin Core:Extent","Dublin Core:Medium","Dublin Core:Bibliographic Citation","Dublin Core:Spatial Coverage","Dublin Core:Temporal Coverage","Dublin Core:Accrual Method","Dublin Core:Accrual Periodicity","Dublin Core:Accrual Policy","Dublin Core:Audience","Dublin Core:Audience Education Level","Dublin Core:Mediator","Dublin Core:Instructional Method","Dublin Core:Provenance","Dublin Core:Rights Holder","Dublin Core:Title","Dublin Core:Subject","Dublin Core:Description","Dublin Core:Creator","Dublin Core:Source","Dublin Core:Publisher","Dublin Core:Date","Dublin Core:Contributor","Dublin Core:Rights","Dublin Core:Relation","Dublin Core:Format","Dublin Core:Language","Dublin Core:Type","Dublin Core:Identifier","Dublin Core:Coverage","Item Type Metadata:Text","Item Type Metadata:Interviewer","Item Type Metadata:Interviewee","Item Type Metadata:Location","Item Type Metadata:Transcription","Item Type Metadata:Local URL","Item Type Metadata:Original Format","Item Type Metadata:Physical Dimensions","Item Type Metadata:Duration","Item Type Metadata:Compression","Item Type Metadata:Producer","Item Type Metadata:Director","Item Type Metadata:Bit Rate/Frequency","Item Type Metadata:Time Summary","Item Type Metadata:Email Body","Item Type Metadata:Subject Line","Item Type Metadata:From","Item Type Metadata:To","Item Type Metadata:CC","Item Type Metadata:BCC","Item Type Metadata:Number of Attachments","Item Type Metadata:Standards","Item Type Metadata:Objectives","Item Type Metadata:Materials","Item Type Metadata:Lesson Plan Text","Item Type Metadata:URL","Item Type Metadata:Event Type","Item Type Metadata:Participants","Item Type Metadata:Birth Date","Item Type Metadata:Birthplace","Item Type Metadata:Death Date","Item Type Metadata:Occupation","Item Type Metadata:Biographical Text","Item Type Metadata:Bibliography","Item Type Metadata:First Name (English)","Item Type Metadata:Last Name (English)","Item Type Metadata:Address","Item Type Metadata:City","Item Type Metadata:State","Item Type Metadata:Business (English)","Item Type Metadata:Provenance (English)","Item Type Metadata:Provenance (Arabic)","Item Type Metadata:Business (Arabic)","Item Type Metadata:Last Name (Arabic)","Item Type Metadata:First Name (Arabic)","Item Type Metadata:Player","Omeka Legacy File:Additional Creator","Omeka Legacy File:Transcriber","Omeka Legacy File:Producer","Omeka Legacy File:Render Device","Omeka Legacy File:Render Details","Omeka Legacy File:Capture Date","Omeka Legacy File:Capture Device","Omeka Legacy File:Capture Details","Omeka Legacy File:Change History","Omeka Legacy File:Watermark","Omeka Legacy File:Encryption","Omeka Legacy File:Compression","Omeka Legacy File:Post Processing","Omeka Image File:Width","Omeka Image File:Height","Omeka Image File:Bit Depth","Omeka Image File:Channels","Omeka Image File:Exif String","Omeka Image File:Exif Array","Omeka Image File:IPTC String","Omeka Image File:IPTC Array","Omeka Video File:Bitrate","Omeka Video File:Duration","Omeka Video File:Sample Rate","Omeka Video File:Codec","Omeka Video File:Width","Omeka Video File:Height","PDF Text:Text","Users Elements:Test","Test Elements:Test",tags,file,itemType,collection,public,featured
78691,https://lebanesestudies.omeka.chass.ncsu.edu/items/show/78691,"Contrat de Transport Par Mer^^ Contract of carriage by sea",,,,,,,,,,,,,,,,,,,,,,,,,,,,,,,,,,,,,,,,"Murad Razouk Immigration Record","Emigration and immigration","Contract for transport by sea for Murad Razouk [45] and his family. His family consisted of two sons, Hami [25] and Navrah [16], a child named Malaheh [3], and a baby named Razouk [2]. The back of the document states that he was Syrian, was travelling to New York, was not traveling for the first time to the U.S., and could read and write. He worked as a merchant or shopkeeper. ","Compagnie Generale Transatlantique","Lawrence Public Library Special Collections","Moise A. Khayrallah Center for Lebanese Diaspora Studies","1913 Dec ","L'Agent pour la Compagnie Generale Transatlantique  ","The donor retains full ownership of any copyright and rights currently controlled. Nonexclusive right to authorize uses of these materials for non-commercial research, scholarly, or other educational purposes are granted to Khayrallah Center pursuant to U.S. Copyright Law. Usage of the materials for these purposes must be fully credited with the source. The user assumes full responsibility for any use of the materials.",,Text/pdf,English,Text,LPL_BRR_RazoukMurad001_wm,"Marseille, France",,,,,,,,,,,,,,,,,,,,,,,,,,,,,,,,,,,,,,,,,,,,,,,,,,,,,,,,,,,,,,,,,,,,,,,,,,,,,"1910s,Families,Immigration,New York,Records",https://lebanesestudies.omeka.chass.ncsu.edu/files/original/353ced7a0687f0ceb46d209ce7f8989e.pdf,,"Collection of Lawrence Public Library Materials",1,0
80523,https://lebanesestudies.omeka.chass.ncsu.edu/items/show/80523,,,,,,,,,,,,,,,,,,,,,,,,,,,,,,,,,,,,,,,,,"""Hudson River Dance Festival shows area diversity"" Newspaper Article","Lebanese Americans^^ Belly dance","Newspaper article in the Daily Gazette of Schenectady about the Hudson River Dance Festival.","Daily Gazette (Schenectady, NY)^^ Wendy Liberatore","Genevieve Rose Joseph","Moise A. Khayrallah Center for Lebanese Diaspora Studies",undated,,"The donor retains full ownership of any copyright and rights currently controlled. Nonexclusive right to authorize uses of these materials for non-commercial research, scholarly, or other educational purposes are granted to Khayrallah Center pursuant to U.S. Copyright Law. Usage of the materials for these purposes must be fully credited with the source. The user assumes full responsibility for any use of the materials.",,Text/pdf,English,Text,kc0062_1_9_033,,,,,,,,,,,,,,,,,,,,,,,,,,,,,,,,,,,,,,,,,,,,,,,,,,,,,,,,,,,,,,,,,,,,,,,,,,,,,,"1990s,Dance,Events,New York,Newspapers",https://lebanesestudies.omeka.chass.ncsu.edu/files/original/23b7fc464e873a4a4c45865c2ef356ae.pdf,,"Joseph Family Papers",1,1
79570,https://lebanesestudies.omeka.chass.ncsu.edu/items/show/79570,,,,,,,,,,,,,,,,,,,,,,,,,,,,,,,,,,,,,,,,,"Letter from Daniel J. Faour to N.N. Hill Brass Co., 1893 December 4",Correspondence,"A letter from Daniel J. Faour in New York, dated December 4, 1893, to the N.N. Brass Company about rattles that were ordered and had yet to arrive. The letterhead is of ""Danial J. Faour &amp^^ Bros. Importers &amp^^ Exporters of Catholic Goods Jewelry &amp^^ Notions,"" at 19 Morris St.","Daniel J. Faour ","Linda Jacobs","Moise A. Khayrallah Center for Lebanese Diaspora Studies","1893 December 04",,"The donor retains full ownership of any copyright and rights currently controlled. Nonexclusive right to authorize uses of these materials for non-commercial research, scholarly, or other educational purposes are granted to Khayrallah Center pursuant to U.S. Copyright Law. Usage of the materials for these purposes must be fully credited with the source. The user assumes full responsibility for any use of the materials.",,Text/pdf,English,Text,LJacobs018,,,,,,,,,,,,,,,,,,,,,,,,,,,,,,,,,,,,,,,,,,,,,,,,,,,,,,,,,,,,,,,,,,,,,,,,,,,,,,"1890s,Business,Letters-English,New York",https://lebanesestudies.omeka.chass.ncsu.edu/files/original/ecae4b7a972c64800505bf46060e8e6c.pdf,,"Linda Jacobs Collection",1,0
82155,https://lebanesestudies.omeka.chass.ncsu.edu/items/show/82155,,,,,,,,,,,,,,,,,,,,,,,,,,,,,,,,,,,,,,,,,"Pocantico Hills Property Abstract of Title 1900","Legal Documents","An Abstract of Title describing premises in Pocantico Hills, sold to Joseph Oussani as part of estate of Grosvenor P. Lowrey, dated 1900.","Davis & Marsh","Oussani Fuleihan family","Moise A. Khayrallah Center for Lebanese Diaspora Studies",1900,,"The donor retains full ownership of any copyright and rights currently controlled. Nonexclusive right to authorize uses of these materials for non-commercial research, scholarly, or other educational purposes are granted to Khayrallah Center pursuant to U.S. Copyright Law. Usage of the materials for these purposes must be fully credited with the source. The user assumes full responsibility for any use of the materials.",,Text/pdf,English,Text,Oussani2018-0299,,,,,,,,,,,,,,,,,,,,,,,,,,,,,,,,,,,,,,,,,,,,,,,,,,,,,,,,,,,,,,,,,,,,,,,,,,,,,,"1900s,New York,Real Estate,Records,Wills",https://lebanesestudies.omeka.chass.ncsu.edu/files/original/8987faa381e14bfe4ec4b94fffddb06a.pdf,,"Oussani and Fuleihan Family Papers Series 1: Documents",1,0
82100,https://lebanesestudies.omeka.chass.ncsu.edu/items/show/82100,,,,,,,,,,,,,,,,,,,,,,,,,,,,,,,,,,,,,,,,,"Gabriel Oussani Death Article Dobbs Ferry","Obituaries^^ Newspapers","A newspaper article from Dobbs Ferry Register, June 8, 1934, titled ""Dr. Oussani, One of Few Priests of Chaldean Rite in US, Dies Here.""","Dobbs Ferry Register","Oussani Fuleihan family","Moise A. Khayrallah Center for Lebanese Diaspora Studies","1934 June 08",,"The donor retains full ownership of any copyright and rights currently controlled. Nonexclusive right to authorize uses of these materials for non-commercial research, scholarly, or other educational purposes are granted to Khayrallah Center pursuant to U.S. Copyright Law. Usage of the materials for these purposes must be fully credited with the source. The user assumes full responsibility for any use of the materials.",,Text/pdf,English,Text,Oussani2018-0359,,,,,,,,,,,,,,,,,,,,,,,,,,,,,,,,,,,,,,,,,,,,,,,,,,,,,,,,,,,,,,,,,,,,,,,,,,,,,,"1930s,Catholic Church,New York,Obituaries",https://lebanesestudies.omeka.chass.ncsu.edu/files/original/e2797e8f9a9224cd82f907393528f5b7.pdf,,"Oussani and Fuleihan Family Papers Series 1: Documents",1,0
80376,https://lebanesestudies.omeka.chass.ncsu.edu/items/show/80376,,,,,,,,,,,,,,,,,,,,,,,,,,,,,,,,,,,,,,,,,"Beatrice Ann Joseph Student Identification Card","Lebanese Americans","Identification card of Beatrice Ann Joseph for Dutchess Community College in Poughkeepsie, New York, from the 1966-1967 school year.","Dutchess Community College","Genevieve Rose Joseph","Moise A. Khayrallah Center for Lebanese Diaspora Studies",1966,,"The donor retains full ownership of any copyright and rights currently controlled. Nonexclusive right to authorize uses of these materials for non-commercial research, scholarly, or other educational purposes are granted to Khayrallah Center pursuant to U.S. Copyright Law. Usage of the materials for these purposes must be fully credited with the source. The user assumes full responsibility for any use of the materials.",,Text/pdf,English,Text,kc0062_1_11_001,,,,,,,,,,,,,,,,,,,,,,,,,,,,,,,,,,,,,,,,,,,,,,,,,,,,,,,,,,,,,,,,,,,,,,,,,,,,,,"Education,Identification Cards,New York",https://lebanesestudies.omeka.chass.ncsu.edu/files/original/fd3fc5aca99a1674793a3b9dc4995d85.pdf,,"Joseph Family Papers",1,1
80483,https://lebanesestudies.omeka.chass.ncsu.edu/items/show/80483,,,,,,,,,,,,,,,,,,,,,,,,,,,,,,,,,,,,,,,,,"""Ethnic Dances of the Near East"" Flyer","Lebanese Americans^^ Belly dance","Flyer for an event titled ""Ethnic Dances of the Near East"" sponsored by eba Center for Dance and Movement and featuring the Yallah Dance Ensemble.","eba Center for Dance and Movement","Genevieve Rose Joseph","Moise A. Khayrallah Center for Lebanese Diaspora Studies","1992 Apr 9",,"The donor retains full ownership of any copyright and rights currently controlled. Nonexclusive right to authorize uses of these materials for non-commercial research, scholarly, or other educational purposes are granted to Khayrallah Center pursuant to U.S. Copyright Law. Usage of the materials for these purposes must be fully credited with the source. The user assumes full responsibility for any use of the materials.",,Text/pdf,English,Text,kc0062_1_8_027,,,,,,,,,,,,,,,,,,,,,,,,,,,,,,,,,,,,,,,,,,,,,,,,,,,,,,,,,,,,,,,,,,,,,,,,,,,,,,"1990s,Dance,Events,New York",https://lebanesestudies.omeka.chass.ncsu.edu/files/original/016fc894f47cb03a14d3e1c0b0830948.pdf,,"Joseph Family Papers",1,1
80487,https://lebanesestudies.omeka.chass.ncsu.edu/items/show/80487,,,,,,,,,,,,,,,,,,,,,,,,,,,,,,,,,,,,,,,,,"Egyptian Dance Workshop Flyer","Lebanese Americans^^ Belly dance","Flyer announcing the arrival of dancer Zayda for a Egyptian Dance Workshop. Also includes an advertisement for Yallah Dance Ensemble's ""Caravans and Desert Sands.""","eba Center for Dance and Movement","Genevieve Rose Joseph","Moise A. Khayrallah Center for Lebanese Diaspora Studies","circa 1993",,"The donor retains full ownership of any copyright and rights currently controlled. Nonexclusive right to authorize uses of these materials for non-commercial research, scholarly, or other educational purposes are granted to Khayrallah Center pursuant to U.S. Copyright Law. Usage of the materials for these purposes must be fully credited with the source. The user assumes full responsibility for any use of the materials.",,Text/pdf,English,Text,kc0062_1_8_031,,,,,,,,,,,,,,,,,,,,,,,,,,,,,,,,,,,,,,,,,,,,,,,,,,,,,,,,,,,,,,,,,,,,,,,,,,,,,,"1990s,Dance,Events,New York",https://lebanesestudies.omeka.chass.ncsu.edu/files/original/32047f69134552bc640957d3ba3a1367.pdf,,"Joseph Family Papers",1,1
82810,https://lebanesestudies.omeka.chass.ncsu.edu/items/show/82810,,,,,,,,,,,,,,,,,,,,,,,,,,,,,,,,,,,,,,,,,"Portrait of Isabel Oussani, 1907","Lebanese--United States^^ Photographs^^ Families","A professional portrait of Isabel Oussani. The back of the photo is labeled, ""Edsall Studio Wm. G. Diekmann Prop. Portraits 246 & 248 West 125th Street, New York."" The picture was likely taken in 1906 or 1907. ","Edsall Studio","Oussani Fuleihan family","Moise A. Khayrallah Center for Lebanese Diaspora Studies",1907,,"The donor retains full ownership of any copyright and rights currently controlled. Nonexclusive right to authorize uses of these materials for non-commercial research, scholarly, or other educational purposes are granted to Khayrallah Center pursuant to U.S. Copyright Law. Usage of the materials for these purposes must be fully credited with the source. The user assumes full responsibility for any use of the materials.",,Image/pdf,English,Image,Oussani2018-0408,,,,,,,,,,,,,,,,,,,,,,,,,,,,,,,,,,,,,,,,,,,,,,,,,,,,,,,,,,,,,,,,,,,,,,,,,,,,,,"1900s,New York,portrait",https://lebanesestudies.omeka.chass.ncsu.edu/files/original/fa4ec4b700733a752a3d8b59e888a5e0.pdf,,"Oussani and Fuleihan Family Papers Series 2: Photographs",1,0
82811,https://lebanesestudies.omeka.chass.ncsu.edu/items/show/82811,,,,,,,,,,,,,,,,,,,,,,,,,,,,,,,,,,,,,,,,,"Portrait of Isabel and Margaret Oussani circa 1907","Lebanese--United States^^ Photographs^^ Families","A professional portrait of Isabel (left) and Margaret (right) Oussani seated on a bench. The photograph is labeled, ""Edsall Studio 248 West 125th Street, New York."" The back of the photo is labeled, ""Wm. G. Diekmann Prop. Portraits 246 & 248 West 125th Street, New York."" The picture was likely taken in 1906 or 1907. ","Edsall Studio","Oussani Fuleihan family","Moise A. Khayrallah Center for Lebanese Diaspora Studies",1907,,"The donor retains full ownership of any copyright and rights currently controlled. Nonexclusive right to authorize uses of these materials for non-commercial research, scholarly, or other educational purposes are granted to Khayrallah Center pursuant to U.S. Copyright Law. Usage of the materials for these purposes must be fully credited with the source. The user assumes full responsibility for any use of the materials.",,Image/pdf,English,Image,Oussani2018-0407,,,,,,,,,,,,,,,,,,,,,,,,,,,,,,,,,,,,,,,,,,,,,,,,,,,,,,,,,,,,,,,,,,,,,,,,,,,,,,"1900s,New York,portrait",https://lebanesestudies.omeka.chass.ncsu.edu/files/original/c86b09e692ada215c7bd2b0c4c0053a9.pdf,,"Oussani and Fuleihan Family Papers Series 2: Photographs",1,0
82812,https://lebanesestudies.omeka.chass.ncsu.edu/items/show/82812,,,,,,,,,,,,,,,,,,,,,,,,,,,,,,,,,,,,,,,,,"Portrait of Margaret Oussani circa 1907","Lebanese--United States^^ Photographs^^ Families","A professional portrait of Margaret Oussani standing in a gate. The photograph is labeled, ""Edsall Studio 248 West 125th Street, New York."" The picture was likely taken in 1906 or 1907. ","Edsall Studio","Oussani Fuleihan family","Moise A. Khayrallah Center for Lebanese Diaspora Studies",1907,,"The donor retains full ownership of any copyright and rights currently controlled. Nonexclusive right to authorize uses of these materials for non-commercial research, scholarly, or other educational purposes are granted to Khayrallah Center pursuant to U.S. Copyright Law. Usage of the materials for these purposes must be fully credited with the source. The user assumes full responsibility for any use of the materials.",,Image/pdf,English,Image,Oussani2018-0406,,,,,,,,,,,,,,,,,,,,,,,,,,,,,,,,,,,,,,,,,,,,,,,,,,,,,,,,,,,,,,,,,,,,,,,,,,,,,,"1900s,New York,portrait",https://lebanesestudies.omeka.chass.ncsu.edu/files/original/863c27e7eabbba0f8cd784958dd27fe8.pdf,,"Oussani and Fuleihan Family Papers Series 2: Photographs",1,0
82294,https://lebanesestudies.omeka.chass.ncsu.edu/items/show/82294,,,,,,,,,,,,,,,,,,,,,,,,,,,,,,,,,,,,,,,,,"Portrait of Neville Fuleihan","Lebanese--United States^^ Photographs^^ Families","Professional photograph of Neville Fuleihan taken by Edward Fantine Studios of Hamilton, New York, labeled on the back as ""For Neville and Caroline.""","Edward Fantine Studios","Oussani Fuleihan family","Moise A. Khayrallah Center for Lebanese Diaspora Studies",1940s-1950s,,"The donor retains full ownership of any copyright and rights currently controlled. Nonexclusive right to authorize uses of these materials for non-commercial research, scholarly, or other educational purposes are granted to Khayrallah Center pursuant to U.S. Copyright Law. Usage of the materials for these purposes must be fully credited with the source. The user assumes full responsibility for any use of the materials.",,Image/pdf,English,Image,Oussani2018-0928,,,,,,,,,,,,,,,,,,,,,,,,,,,,,,,,,,,,,,,,,,,,,,,,,,,,,,,,,,,,,,,,,,,,,,,,,,,,,,"New York,portrait",https://lebanesestudies.omeka.chass.ncsu.edu/files/original/d15b21ff4eb67fbfc6d0f99e1785066f.pdf,,"Oussani and Fuleihan Family Papers Series 2: Photographs",1,0
81991,https://lebanesestudies.omeka.chass.ncsu.edu/items/show/81991,,,,,,,,,,,,,,,,,,,,,,,,,,,,,,,,,,,,,,,,,"Letter from Edward Mitty to Margaret Oussani, 1971 November 23","Correspondence^^ Cemeteries","A letter from Edward Mitty, Executive Director of the Trustees of St. Patrick's Cathedral, to Margaret Oussani acknowledging receipt of her payment for the Permanent Care of graves in Calvary Cemetery, dated 23 November 1971.","Edward Mitty, St. Patrick's Cathedral","Oussani Fuleihan family","Moise A. Khayrallah Center for Lebanese Diaspora Studies","1971 November 23",,"The donor retains full ownership of any copyright and rights currently controlled. Nonexclusive right to authorize uses of these materials for non-commercial research, scholarly, or other educational purposes are granted to Khayrallah Center pursuant to U.S. Copyright Law. Usage of the materials for these purposes must be fully credited with the source. The user assumes full responsibility for any use of the materials.",,Text/pdf,English,Text,Oussani2018-1142,,,,,,,,,,,,,,,,,,,,,,,,,,,,,,,,,,,,,,,,,,,,,,,,,,,,,,,,,,,,,,,,,,,,,,,,,,,,,,"1970s,Cemeteries,Finance,Letters-English,New York",https://lebanesestudies.omeka.chass.ncsu.edu/files/original/a19c5489340fb0271d98c43b9a094c48.pdf,,"Oussani and Fuleihan Family Papers Series 1: Documents",1,0
80478,https://lebanesestudies.omeka.chass.ncsu.edu/items/show/80478,,,,,,,,,,,,,,,,,,,,,,,,,,,,,,,,,,,,,,,,,"""Festival of the Nile"" Program Booklet","Lebanese Americans^^ Belly dance","Program for an event titled ""Festival of the Nile"" sponsored by the Egyptian Ministry of Culture through members of the Nile Traditional Folklore Group.","Egyptian Ministry of Culture","Genevieve Rose Joseph","Moise A. Khayrallah Center for Lebanese Diaspora Studies",undated,,"The donor retains full ownership of any copyright and rights currently controlled. Nonexclusive right to authorize uses of these materials for non-commercial research, scholarly, or other educational purposes are granted to Khayrallah Center pursuant to U.S. Copyright Law. Usage of the materials for these purposes must be fully credited with the source. The user assumes full responsibility for any use of the materials.",,Text/pdf,English,Text,kc0062_1_8_022,,,,,,,,,,,,,,,,,,,,,,,,,,,,,,,,,,,,,,,,,,,,,,,,,,,,,,,,,,,,,,,,,,,,,,,,,,,,,,"1990s,Booklets,Dance,Events,New York,Programs,Theater",https://lebanesestudies.omeka.chass.ncsu.edu/files/original/78329f53c427c552921175d21228d9cc.pdf,,"Joseph Family Papers",1,1
78654,https://lebanesestudies.omeka.chass.ncsu.edu/items/show/78654,,,,,,,,,,,,,,,,,,,,,,,,,,,,,,,,,,,,,,,,,"Saud Immigration Record","Emigration and immigration","An immigration record issued in Naples, Italy, on March 27, 1914, for a journey to New York. The record, likely a ticket, was issued to Saud [?] [Saa?].","Emigration Office of Naples^^ Ufficio Emigrazione di Napoli","Lawrence Public Library Special Collections","Moise A. Khayrallah Center for Lebanese Diaspora Studies","1914 March",,"The donor retains full ownership of any copyright and rights currently controlled. Nonexclusive right to authorize uses of these materials for non-commercial research, scholarly, or other educational purposes are granted to Khayrallah Center pursuant to U.S. Copyright Law. Usage of the materials for these purposes must be fully credited with the source. The user assumes full responsibility for any use of the materials.",,Text/pdf,English,Text,LPL_BRR_SaudS001_wm,"Naples, Italy",,,,,,,,,,,,,,,,,,,,,,,,,,,,,,,,,,,,,,,,,,,,,,,,,,,,,,,,,,,,,,,,,,,,,,,,,,,,,"1910s,Immigration,Italy,New York,Records,Tickets",https://lebanesestudies.omeka.chass.ncsu.edu/files/original/52e9c43d37d76465e533e6a1c3a2043c.pdf,,"Collection of Lawrence Public Library Materials",1,0
80473,https://lebanesestudies.omeka.chass.ncsu.edu/items/show/80473,,,,,,,,,,,,,,,,,,,,,,,,,,,,,,,,,,,,,,,,,"""Albany 1st Night"" Newspaper Article","Lebanese Americans^^ Belly dance","Newspaper article about the Albany First Night festival, in which the Yallah Dance Ensemble performed.","Erwin Karl","Genevieve Rose Joseph","Moise A. Khayrallah Center for Lebanese Diaspora Studies","1993 Dec",,"The donor retains full ownership of any copyright and rights currently controlled. Nonexclusive right to authorize uses of these materials for non-commercial research, scholarly, or other educational purposes are granted to Khayrallah Center pursuant to U.S. Copyright Law. Usage of the materials for these purposes must be fully credited with the source. The user assumes full responsibility for any use of the materials.",,Text/pdf,English,Text,kc0062_1_8_017,,,,,,,,,,,,,,,,,,,,,,,,,,,,,,,,,,,,,,,,,,,,,,,,,,,,,,,,,,,,,,,,,,,,,,,,,,,,,,"1990s,Dance,Events,New York,Newspapers",https://lebanesestudies.omeka.chass.ncsu.edu/files/original/77d48b9343986217a4e7c8c08de80d29.pdf,,"Joseph Family Papers",1,1