﻿"Item Id","Item URI","Dublin Core:Alternative Title","Dublin Core:Abstract","Dublin Core:Table Of Contents","Dublin Core:Date Available","Dublin Core:Date Created","Dublin Core:Date Accepted","Dublin Core:Date Copyrighted","Dublin Core:Date Submitted","Dublin Core:Date Issued","Dublin Core:Date Modified","Dublin Core:Date Valid","Dublin Core:Access Rights","Dublin Core:License","Dublin Core:Conforms To","Dublin Core:Has Format","Dublin Core:Has Part","Dublin Core:Has Version","Dublin Core:Is Format Of","Dublin Core:Is Part Of","Dublin Core:Is Referenced By","Dublin Core:Is Replaced By","Dublin Core:Is Required By","Dublin Core:Is Version Of","Dublin Core:References","Dublin Core:Replaces","Dublin Core:Requires","Dublin Core:Extent","Dublin Core:Medium","Dublin Core:Bibliographic Citation","Dublin Core:Spatial Coverage","Dublin Core:Temporal Coverage","Dublin Core:Accrual Method","Dublin Core:Accrual Periodicity","Dublin Core:Accrual Policy","Dublin Core:Audience","Dublin Core:Audience Education Level","Dublin Core:Mediator","Dublin Core:Instructional Method","Dublin Core:Provenance","Dublin Core:Rights Holder","Dublin Core:Title","Dublin Core:Subject","Dublin Core:Description","Dublin Core:Creator","Dublin Core:Source","Dublin Core:Publisher","Dublin Core:Date","Dublin Core:Contributor","Dublin Core:Rights","Dublin Core:Relation","Dublin Core:Format","Dublin Core:Language","Dublin Core:Type","Dublin Core:Identifier","Dublin Core:Coverage","Item Type Metadata:Text","Item Type Metadata:Interviewer","Item Type Metadata:Interviewee","Item Type Metadata:Location","Item Type Metadata:Transcription","Item Type Metadata:Local URL","Item Type Metadata:Original Format","Item Type Metadata:Physical Dimensions","Item Type Metadata:Duration","Item Type Metadata:Compression","Item Type Metadata:Producer","Item Type Metadata:Director","Item Type Metadata:Bit Rate/Frequency","Item Type Metadata:Time Summary","Item Type Metadata:Email Body","Item Type Metadata:Subject Line","Item Type Metadata:From","Item Type Metadata:To","Item Type Metadata:CC","Item Type Metadata:BCC","Item Type Metadata:Number of Attachments","Item Type Metadata:Standards","Item Type Metadata:Objectives","Item Type Metadata:Materials","Item Type Metadata:Lesson Plan Text","Item Type Metadata:URL","Item Type Metadata:Event Type","Item Type Metadata:Participants","Item Type Metadata:Birth Date","Item Type Metadata:Birthplace","Item Type Metadata:Death Date","Item Type Metadata:Occupation","Item Type Metadata:Biographical Text","Item Type Metadata:Bibliography","Item Type Metadata:First Name (English)","Item Type Metadata:Last Name (English)","Item Type Metadata:Address","Item Type Metadata:City","Item Type Metadata:State","Item Type Metadata:Business (English)","Item Type Metadata:Provenance (English)","Item Type Metadata:Provenance (Arabic)","Item Type Metadata:Business (Arabic)","Item Type Metadata:Last Name (Arabic)","Item Type Metadata:First Name (Arabic)","Item Type Metadata:Player","Omeka Legacy File:Additional Creator","Omeka Legacy File:Transcriber","Omeka Legacy File:Producer","Omeka Legacy File:Render Device","Omeka Legacy File:Render Details","Omeka Legacy File:Capture Date","Omeka Legacy File:Capture Device","Omeka Legacy File:Capture Details","Omeka Legacy File:Change History","Omeka Legacy File:Watermark","Omeka Legacy File:Encryption","Omeka Legacy File:Compression","Omeka Legacy File:Post Processing","Omeka Image File:Width","Omeka Image File:Height","Omeka Image File:Bit Depth","Omeka Image File:Channels","Omeka Image File:Exif String","Omeka Image File:Exif Array","Omeka Image File:IPTC String","Omeka Image File:IPTC Array","Omeka Video File:Bitrate","Omeka Video File:Duration","Omeka Video File:Sample Rate","Omeka Video File:Codec","Omeka Video File:Width","Omeka Video File:Height","PDF Text:Text","Users Elements:Test","Test Elements:Test",tags,file,itemType,collection,public,featured
13466,https://lebanesestudies.omeka.chass.ncsu.edu/items/show/13466,,,,,,,,,,,,,,,,,,,,,,,,,,,,,,,,,,,,,,,,,"Yemna Mokarzel Dining with Women","Women--Lebanese American","A photo of Yemna Mokarzel (left) with two unidentified women. The woman to her right may be her sister Rose Mokarzel Tanous. (Folder 2-1-3-15)",Unknown,"Helen Samhan","Moise A. Khayrallah Center for Lebanese Diaspora Studies",Unknown,,"Donor retains full ownership of any and all copyright currently controlled in agreement with Khayrallah Center. Nonexclusive right to authorize all uses of these materials for non-commercial research, scholarly, or other educational purposes are granted to Khayrallah Center pursuant to Creative Commons Attribution-NonCommercial-ShareAlike (CC BY-NC-SA).",,Image/jpg,,Image,"Mokarzel 2-1-3-15 Sisters_wm",,,,,,,,"Color photograph",,,,,,,,,,,,,,,,,,,,,,,,,,,,,,,,,,,,,,,,,,,,,,,,,,,,,,,,,,,,,,,,,,,,,,"Food,Mokarzel,Yemna Mokarzel",https://lebanesestudies.omeka.chass.ncsu.edu/files/original/490804d0086443d6368e9062e009ee75.jpg,"Still Image","Mokarzel Family",1,0
79233,https://lebanesestudies.omeka.chass.ncsu.edu/items/show/79233,,,,,,,,,,,,,,,,,,,,,,,,,,,,,,,,,,,,,,,,,"Vera's Graduation","Photographs^^ Education","A photograph of Vera Tayeh Khayrallah, dressed in graduate robes, cutting a cake. Three unidentified people are visible in the background. The photograph is part of a set labeled ""87m Host Family.""",,"Moise and Vera Khayrallah","Moise A. Khayrallah Center for Lebanese Diaspora Studies",undated,,"The donor retains full ownership of any copyright and rights currently controlled. Nonexclusive right to authorize uses of these materials for non-commercial research, scholarly, or other educational purposes are granted to Khayrallah Center pursuant to U.S. Copyright Law. Usage of the materials for these purposes must be fully credited with the source. The user assumes full responsibility for any use of the materials.",,Image/pdf,,Image,kc0036_052,,,,,,,,,,,,,,,,,,,,,,,,,,,,,,,,,,,,,,,,,,,,,,,,,,,,,,,,,,,,,,,,,,,,,,,,,,,,,,"Education,Events,Food",https://lebanesestudies.omeka.chass.ncsu.edu/files/original/6d7ebaa69b6b7df5595e56a8fb66bcb3.pdf,,"Moise and Vera Khayrallah Papers",1,0
80544,https://lebanesestudies.omeka.chass.ncsu.edu/items/show/80544,,,,,,,,,,,,,,,,,,,,,,,,,,,,,,,,,,,,,,,,,"South Pacific Polynesian Restaurant Postcard and Group Photograph","Lebanese Americans^^ Photographs","Postcard with an image of the South Pacific Polynesian Restaurant on US Route 1 south of Hollywood, Florida, with a group photo of four people, Bill Bolde, Lorice (Louty) Bolde, Genevieve Norman Joseph, and Charles Joseph, inside of the restaurant.",,"Genevieve Rose Joseph","Moise A. Khayrallah Center for Lebanese Diaspora Studies",undated,,"The donor retains full ownership of any copyright and rights currently controlled. Nonexclusive right to authorize uses of these materials for non-commercial research, scholarly, or other educational purposes are granted to Khayrallah Center pursuant to U.S. Copyright Law. Usage of the materials for these purposes must be fully credited with the source. The user assumes full responsibility for any use of the materials.",,Image/pdf,English,Image,kc0062_2_1_017,,,,,,,,,,,,,,,,,,,,,,,,,,,,,,,,,,,,,,,,,,,,,,,,,,,,,,,,,,,,,,,,,,,,,,,,,,,,,,"Business,Food,Postcards",https://lebanesestudies.omeka.chass.ncsu.edu/files/original/9fa8a878bee931195c13e6570ada6a50.pdf,,"Joseph Family Papers",1,1
79174,https://lebanesestudies.omeka.chass.ncsu.edu/items/show/79174,,,,,,,,,,,,,,,,,,,,,,,,,,,,,,,,,,,,,,,,,"Samir Saleh in the Neomonde Baking Company, 1979","Family business^^ Photographs","A photograph of Sam Saleh at work at Neomonde Baking Company in 1979.",,"Samir Saleh","Moise A. Khayrallah Center for Lebanese Diaspora Studies",1979,,"The donor retains full ownership of any copyright and rights currently controlled. Nonexclusive right to authorize uses of these materials for non-commercial research, scholarly, or other educational purposes are granted to Khayrallah Center pursuant to U.S. Copyright Law. Usage of the materials for these purposes must be fully credited with the source. The user assumes full responsibility for any use of the materials.",,Image/pdf,,Image,kc0032_022,,,,,,,,,,,,,,,,,,,,,,,,,,,,,,,,,,,,,,,,,,,,,,,,,,,,,,,,,,,,,,,,,,,,,,,,,,,,,,"1970s,Business,Food,North Carolina",https://lebanesestudies.omeka.chass.ncsu.edu/files/original/3dab921ae31e1a00c9aba2d831474b5a.pdf,,"Saleh Family Papers",1,0
79175,https://lebanesestudies.omeka.chass.ncsu.edu/items/show/79175,,,,,,,,,,,,,,,,,,,,,,,,,,,,,,,,,,,,,,,,,"Samir Saleh at Work 1979","Family business^^ Photographs","A photograph of Sam Saleh at work at Neomonde Baking Company in 1979.",,"Samir Saleh","Moise A. Khayrallah Center for Lebanese Diaspora Studies",1979,,"The donor retains full ownership of any copyright and rights currently controlled. Nonexclusive right to authorize uses of these materials for non-commercial research, scholarly, or other educational purposes are granted to Khayrallah Center pursuant to U.S. Copyright Law. Usage of the materials for these purposes must be fully credited with the source. The user assumes full responsibility for any use of the materials.",,Image/pdf,,Image,kc0032_021,,,,,,,,,,,,,,,,,,,,,,,,,,,,,,,,,,,,,,,,,,,,,,,,,,,,,,,,,,,,,,,,,,,,,,,,,,,,,,"1970s,Business,Food,North Carolina",https://lebanesestudies.omeka.chass.ncsu.edu/files/original/2b385db5437c27d3f7e900086e268ab5.pdf,,"Saleh Family Papers",1,0
82247,https://lebanesestudies.omeka.chass.ncsu.edu/items/show/82247,,,,,,,,,,,,,,,,,,,,,,,,,,,,,,,,,,,,,,,,,"Sam O'Keefe with Turkey","Lebanese--United States^^ Photographs^^ Families","A photograph of Sam O'Keefe posing with a cooked turkey. Taken by Anis Fuleihan.",,"Oussani Fuleihan family","Moise A. Khayrallah Center for Lebanese Diaspora Studies",1968,,"The donor retains full ownership of any copyright and rights currently controlled. Nonexclusive right to authorize uses of these materials for non-commercial research, scholarly, or other educational purposes are granted to Khayrallah Center pursuant to U.S. Copyright Law. Usage of the materials for these purposes must be fully credited with the source. The user assumes full responsibility for any use of the materials.",,Image/pdf,,Image,Oussani2018-0976,,,,,,,,,,,,,,,,,,,,,,,,,,,,,,,,,,,,,,,,,,,,,,,,,,,,,,,,,,,,,,,,,,,,,,,,,,,,,,"1960s,Food",https://lebanesestudies.omeka.chass.ncsu.edu/files/original/52421568bd2cc8dbc0c30a5dcb702844.pdf,,"Oussani and Fuleihan Family Papers Series 2: Photographs",1,0
79177,https://lebanesestudies.omeka.chass.ncsu.edu/items/show/79177,,,,,,,,,,,,,,,,,,,,,,,,,,,,,,,,,,,,,,,,,"Saleh Family in the Neomonde Baking Company, 1980s","Family business^^ Photographs","A photograph of the Saleh family in the Neomonde Baking Company. Though undated, the photograph is estimated to date from the late 1970s or early 1980s.",,"Samir Saleh","Moise A. Khayrallah Center for Lebanese Diaspora Studies","circa 1980",,"The donor retains full ownership of any copyright and rights currently controlled. Nonexclusive right to authorize uses of these materials for non-commercial research, scholarly, or other educational purposes are granted to Khayrallah Center pursuant to U.S. Copyright Law. Usage of the materials for these purposes must be fully credited with the source. The user assumes full responsibility for any use of the materials.",,Image/pdf,,Image,kc0032_019,,,,,,,,,,,,,,,,,,,,,,,,,,,,,,,,,,,,,,,,,,,,,,,,,,,,,,,,,,,,,,,,,,,,,,,,,,,,,,"1980s,Business,Families,Food,North Carolina",https://lebanesestudies.omeka.chass.ncsu.edu/files/original/c354fe25f054b9def298d934b1b994cb.pdf,,"Saleh Family Papers",1,0
11825,https://lebanesestudies.omeka.chass.ncsu.edu/items/show/11825,,,,,,,,,,,,,,,,,,,,,,,,,,,,,,,,,,,,,,,,,"Royal Dutch Airlines Postcard",Postcards,"A postcard depicting the plane the Joe El-Khouri took from Lebanon to the United States in 1949.  (2016 Folder 7-10)","K. L. M. ","Marsha El-Khouri Shiver","Moise A. Khayrallah Center for Lebanese Diaspora Studies","October 10, 1949",,"Donor retains full ownership of any and all copyright currently controlled in agreement with Khayrallah Center. Nonexclusive right to authorize all uses of these materials for non-commercial research, scholarly, or other educational purposes are granted to Khayrallah Center pursuant to Creative Commons Attribution-NonCommercial-ShareAlike (CC BY-NC-SA).",,Image/jpg,English,Image,,,,,,,,,"Black & white photograph",,,,,,,,,,,,,,,,,,,,,,,,,,,,,,,,,,,,,,,,,,,,,,,,,,,,,,,,,,,,,,,,,,,,,,"1940's,Airplanes,El-Khouri,Food,Immigration,Joseph El-Khouri,Postcards",https://lebanesestudies.omeka.chass.ncsu.edu/files/original/76c9e15304d56be00c29b32590f98409.pdf,"Still Image","El-Khouri Family",1,0
81016,https://lebanesestudies.omeka.chass.ncsu.edu/items/show/81016,,,,,,,,,,,,,,,,,,,,,,,,,,,,,,,,,,,,,,,,,"Rose Norman Photograph","Lebanese Americans^^ Photographs","Photograph of a woman standing in a market, probably Rose Norman.",,"Genevieve Rose Joseph","Moise A. Khayrallah Center for Lebanese Diaspora Studies",undated,,"The donor retains full ownership of any copyright and rights currently controlled. Nonexclusive right to authorize uses of these materials for non-commercial research, scholarly, or other educational purposes are granted to Khayrallah Center pursuant to U.S. Copyright Law. Usage of the materials for these purposes must be fully credited with the source. The user assumes full responsibility for any use of the materials.",,Image/pdf,English,Image,kc0062_2_8_005,,,,,,,,,,,,,,,,,,,,,,,,,,,,,,,,,,,,,,,,,,,,,,,,,,,,,,,,,,,,,,,,,,,,,,,,,,,,,,"Business,Food",https://lebanesestudies.omeka.chass.ncsu.edu/files/original/9dd781e1999e3e1a4cf1e522b79077b7.pdf,,"Joseph Family Papers",1,1
81015,https://lebanesestudies.omeka.chass.ncsu.edu/items/show/81015,,,,,,,,,,,,,,,,,,,,,,,,,,,,,,,,,,,,,,,,,"Rose Norman Photograph","Lebanese Americans^^ Photographs","Photograph of a woman standing in a market, probably Rose Norman.",,"Genevieve Rose Joseph","Moise A. Khayrallah Center for Lebanese Diaspora Studies",undated,,"The donor retains full ownership of any copyright and rights currently controlled. Nonexclusive right to authorize uses of these materials for non-commercial research, scholarly, or other educational purposes are granted to Khayrallah Center pursuant to U.S. Copyright Law. Usage of the materials for these purposes must be fully credited with the source. The user assumes full responsibility for any use of the materials.",,Image/pdf,English,Image,kc0062_2_8_004,,,,,,,,,,,,,,,,,,,,,,,,,,,,,,,,,,,,,,,,,,,,,,,,,,,,,,,,,,,,,,,,,,,,,,,,,,,,,,"Business,Food",https://lebanesestudies.omeka.chass.ncsu.edu/files/original/aa161e3b125087e0e043d7c167b8dc4f.pdf,,"Joseph Family Papers",1,1
81014,https://lebanesestudies.omeka.chass.ncsu.edu/items/show/81014,,,,,,,,,,,,,,,,,,,,,,,,,,,,,,,,,,,,,,,,,"Rose Norman Photograph","Lebanese Americans^^ Photographs","Photograph of a woman standing in a market wearing an apron, probably Rose Norman.",,"Genevieve Rose Joseph","Moise A. Khayrallah Center for Lebanese Diaspora Studies",undated,,"The donor retains full ownership of any copyright and rights currently controlled. Nonexclusive right to authorize uses of these materials for non-commercial research, scholarly, or other educational purposes are granted to Khayrallah Center pursuant to U.S. Copyright Law. Usage of the materials for these purposes must be fully credited with the source. The user assumes full responsibility for any use of the materials.",,Image/pdf,English,Image,kc0062_2_8_003,,,,,,,,,,,,,,,,,,,,,,,,,,,,,,,,,,,,,,,,,,,,,,,,,,,,,,,,,,,,,,,,,,,,,,,,,,,,,,"Business,Food",https://lebanesestudies.omeka.chass.ncsu.edu/files/original/00948d4ffaf357876624508d03d1bf53.pdf,,"Joseph Family Papers",1,1
80797,https://lebanesestudies.omeka.chass.ncsu.edu/items/show/80797,,,,,,,,,,,,,,,,,,,,,,,,,,,,,,,,,,,,,,,,,"Rose Norman in Store","Lebanese Americans^^ Photographs","Photograph of Rose Norman in her store in Poughkeepsie, New York.",,"Genevieve Rose Joseph","Moise A. Khayrallah Center for Lebanese Diaspora Studies","1949 Sep 2",,"The donor retains full ownership of any copyright and rights currently controlled. Nonexclusive right to authorize uses of these materials for non-commercial research, scholarly, or other educational purposes are granted to Khayrallah Center pursuant to U.S. Copyright Law. Usage of the materials for these purposes must be fully credited with the source. The user assumes full responsibility for any use of the materials.",,Image/pdf,English,Image,kc0062_2_15_025,,,,,,,,,,,,,,,,,,,,,,,,,,,,,,,,,,,,,,,,,,,,,,,,,,,,,,,,,,,,,,,,,,,,,,,,,,,,,,"1940s,Business,Food",https://lebanesestudies.omeka.chass.ncsu.edu/files/original/fc92edefbc4cff18ad3d849b5b24670b.pdf,,"Joseph Family Papers",1,1
11869,https://lebanesestudies.omeka.chass.ncsu.edu/items/show/11869,,,,,,,,,,,,,,,,,,,,,,,,,,,,,,,,,,,,,,,,,"Program for the First Solemn High Mass and Benediction at St. Anthony's Church","Religious Rites & Ceremonies--Catholic","A program outlining the history of the Maronite rite, Rev. George J. Webby's biography, the First Solemn High Mass, the dinner menu, speakers, and the benediction of the Blessed Sacrament. (Folder 11-8)","Saint Anthony's Maronite Church","Marsha El-Khouri Shiver","Moise A. Khayrallah Center for Lebanese Diaspora Studies","August 23, 1953",,"Donor retains full ownership of any and all copyright currently controlled in agreement with Khayrallah Center. Nonexclusive right to authorize all uses of these materials for non-commercial research, scholarly, or other educational purposes are granted to Khayrallah Center pursuant to Creative Commons Attribution-NonCommercial-ShareAlike (CC BY-NC-SA).",,Text/pdf,English,Text,"2016 11-08",,,,,,,,Paper,,,,,,,,,,,,,,,,,,,,,,,,,,,,,,,,,,,,,,,,,,,,,,,,,,,,,,,,,,,,,,,,,,,,,,"1950's,Catholic Church,Food,Maronite Church,Saint Anthony's Maronite Church,Wilkes-Barre, Pennsylvania",https://lebanesestudies.omeka.chass.ncsu.edu/files/original/6ea35e66fdea680dffafc185e3734fa8.pdf,Document,"El-Khouri Family",1,0
79194,https://lebanesestudies.omeka.chass.ncsu.edu/items/show/79194,,,,,,,,,,,,,,,,,,,,,,,,,,,,,,,,,,,,,,,,,"Profile of Cecilia Saleh","Newspapers^^ Emigration and immigration","A short profile of Cecilia Saleh, conducted with the translation help of her son, Sam. The brief interview touches on Cecilia's immigration to the United States and her role in the family business. ","Raleigh News and Observer","Samir Saleh","Moise A. Khayrallah Center for Lebanese Diaspora Studies",2008,"Andrea Weigl","The donor retains full ownership of any copyright and rights currently controlled. Nonexclusive right to authorize uses of these materials for non-commercial research, scholarly, or other educational purposes are granted to Khayrallah Center pursuant to U.S. Copyright Law. Usage of the materials for these purposes must be fully credited with the source. The user assumes full responsibility for any use of the materials.",,Image/pdf,English,Image,kc0032_002,,,,,,,,,,,,,,,,,,,,,,,,,,,,,,,,,,,,,,,,,,,,,,,,,,,,,,,,,,,,,,,,,,,,,,,,,,,,,,"2000s,Business,Food,Immigration,Newspapers",https://lebanesestudies.omeka.chass.ncsu.edu/files/original/638dbe3d17a1aa5b3d5afc4b7a04a98d.pdf,,"Saleh Family Papers",1,0
79580,https://lebanesestudies.omeka.chass.ncsu.edu/items/show/79580,,,,,,,,,,,,,,,,,,,,,,,,,,,,,,,,,,,,,,,,,"Postcard Depicting Kalil’s Main Dining Room at Park Place, New York City",Postcards,"A postcard of “Kalil’s Main Dining Room Near City Hall Park, 14-16-18 Park Place, New York City.” Abu Khalil's restaurant on Park Row was a 1000 seat restaurant with a Roman and Egyptian restaurant below and Grotto. Khalil married one of Helen Malhame's aunts [See Malhame Collection on our site].","The Platinachrome Co.","Linda Jacobs","Moise A. Khayrallah Center for Lebanese Diaspora Studies",undated,,"The donor retains full ownership of any copyright and rights currently controlled. Nonexclusive right to authorize uses of these materials for non-commercial research, scholarly, or other educational purposes are granted to Khayrallah Center pursuant to U.S. Copyright Law. Usage of the materials for these purposes must be fully credited with the source. The user assumes full responsibility for any use of the materials.",,Image/pdf,English,Image,LJacobs008,,,,,,,,,,,,,,,,,,,,,,,,,,,,,,,,,,,,,,,,,,,,,,,,,,,,,,,,,,,,,,,,,,,,,,,,,,,,,,"Families,Food,New York,Postcards",https://lebanesestudies.omeka.chass.ncsu.edu/files/original/31b5f9e49e5583eb5d18c9191dc7ecb8.pdf,,"Linda Jacobs Collection",1,0
76003,https://lebanesestudies.omeka.chass.ncsu.edu/items/show/76003,,,,,,,,,,,,,,,,,,,,,,,,,,,,,,,,,,,,,,,,,"Picture of Carolyn Dorroll from The Fayetteville Observer","Clippings (Books, newspapers, etc.)","A portrait of Carolyn Dorroll (left) with three unidentified women posing in front of a spread of Lebanese food, published in <em>The Fayetteville Observer</em>.","<em>The Fayetteville Observer</em>","Carolyn Monsour Dorroll","Moise A. Khayrallah Center for Lebanese Diaspora Studies","1993 Sept 8",,"The donor retains full ownership of any copyright and rights currently controlled. Nonexclusive right to authorize uses of these materials for non-commercial research, scholarly, or other educational purposes are granted to Khayrallah Center pursuant to U.S. Copyright Law. Usage of the materials for these purposes must be fully credited with the source. The user assumes full responsibility for any use of the materials.",,Image/jpg,English,Image,CarolynDorrollFayetvilleObserver-1_wm,,,,,,,,,,,,,,,,,,,,,,,,,,,,,,,,,,,,,,,,,,,,,,,,,,,,,,,,,,,,,,,,,,,,,,,,,,,,,,"1990s,Fayetteville Observer,Food,Newspapers,North Carolina",https://lebanesestudies.omeka.chass.ncsu.edu/files/original/fafbb5bdee9f4e0dcf1a6088b0acf794.jpg,,"Carolyn Dorroll Photographs",1,0
80984,https://lebanesestudies.omeka.chass.ncsu.edu/items/show/80984,,,,,,,,,,,,,,,,,,,,,,,,,,,,,,,,,,,,,,,,,"Picnic Photograph","Lebanese Americans^^ Photographs","Photograph of [Elena Kelly?] and Genevieve Norman Joseph at a picnic table.",,"Genevieve Rose Joseph","Moise A. Khayrallah Center for Lebanese Diaspora Studies","1981 Aug 22",,"The donor retains full ownership of any copyright and rights currently controlled. Nonexclusive right to authorize uses of these materials for non-commercial research, scholarly, or other educational purposes are granted to Khayrallah Center pursuant to U.S. Copyright Law. Usage of the materials for these purposes must be fully credited with the source. The user assumes full responsibility for any use of the materials.",,Image/pdf,English,Image,kc0062_2_5_006,,,,,,,,,,,,,,,,,,,,,,,,,,,,,,,,,,,,,,,,,,,,,,,,,,,,,,,,,,,,,,,,,,,,,,,,,,,,,,"1980s,Events,Food",https://lebanesestudies.omeka.chass.ncsu.edu/files/original/a9f144488568d1eb574928f82c457eff.pdf,,"Joseph Family Papers",1,1