﻿"Item Id","Item URI","Dublin Core:Alternative Title","Dublin Core:Abstract","Dublin Core:Table Of Contents","Dublin Core:Date Available","Dublin Core:Date Created","Dublin Core:Date Accepted","Dublin Core:Date Copyrighted","Dublin Core:Date Submitted","Dublin Core:Date Issued","Dublin Core:Date Modified","Dublin Core:Date Valid","Dublin Core:Access Rights","Dublin Core:License","Dublin Core:Conforms To","Dublin Core:Has Format","Dublin Core:Has Part","Dublin Core:Has Version","Dublin Core:Is Format Of","Dublin Core:Is Part Of","Dublin Core:Is Referenced By","Dublin Core:Is Replaced By","Dublin Core:Is Required By","Dublin Core:Is Version Of","Dublin Core:References","Dublin Core:Replaces","Dublin Core:Requires","Dublin Core:Extent","Dublin Core:Medium","Dublin Core:Bibliographic Citation","Dublin Core:Spatial Coverage","Dublin Core:Temporal Coverage","Dublin Core:Accrual Method","Dublin Core:Accrual Periodicity","Dublin Core:Accrual Policy","Dublin Core:Audience","Dublin Core:Audience Education Level","Dublin Core:Mediator","Dublin Core:Instructional Method","Dublin Core:Provenance","Dublin Core:Rights Holder","Dublin Core:Title","Dublin Core:Subject","Dublin Core:Description","Dublin Core:Creator","Dublin Core:Source","Dublin Core:Publisher","Dublin Core:Date","Dublin Core:Contributor","Dublin Core:Rights","Dublin Core:Relation","Dublin Core:Format","Dublin Core:Language","Dublin Core:Type","Dublin Core:Identifier","Dublin Core:Coverage","Item Type Metadata:Text","Item Type Metadata:Interviewer","Item Type Metadata:Interviewee","Item Type Metadata:Location","Item Type Metadata:Transcription","Item Type Metadata:Local URL","Item Type Metadata:Original Format","Item Type Metadata:Physical Dimensions","Item Type Metadata:Duration","Item Type Metadata:Compression","Item Type Metadata:Producer","Item Type Metadata:Director","Item Type Metadata:Bit Rate/Frequency","Item Type Metadata:Time Summary","Item Type Metadata:Email Body","Item Type Metadata:Subject Line","Item Type Metadata:From","Item Type Metadata:To","Item Type Metadata:CC","Item Type Metadata:BCC","Item Type Metadata:Number of Attachments","Item Type Metadata:Standards","Item Type Metadata:Objectives","Item Type Metadata:Materials","Item Type Metadata:Lesson Plan Text","Item Type Metadata:URL","Item Type Metadata:Event Type","Item Type Metadata:Participants","Item Type Metadata:Birth Date","Item Type Metadata:Birthplace","Item Type Metadata:Death Date","Item Type Metadata:Occupation","Item Type Metadata:Biographical Text","Item Type Metadata:Bibliography","Item Type Metadata:First Name (English)","Item Type Metadata:Last Name (English)","Item Type Metadata:Address","Item Type Metadata:City","Item Type Metadata:State","Item Type Metadata:Business (English)","Item Type Metadata:Provenance (English)","Item Type Metadata:Provenance (Arabic)","Item Type Metadata:Business (Arabic)","Item Type Metadata:Last Name (Arabic)","Item Type Metadata:First Name (Arabic)","Item Type Metadata:Player","Omeka Legacy File:Additional Creator","Omeka Legacy File:Transcriber","Omeka Legacy File:Producer","Omeka Legacy File:Render Device","Omeka Legacy File:Render Details","Omeka Legacy File:Capture Date","Omeka Legacy File:Capture Device","Omeka Legacy File:Capture Details","Omeka Legacy File:Change History","Omeka Legacy File:Watermark","Omeka Legacy File:Encryption","Omeka Legacy File:Compression","Omeka Legacy File:Post Processing","Omeka Image File:Width","Omeka Image File:Height","Omeka Image File:Bit Depth","Omeka Image File:Channels","Omeka Image File:Exif String","Omeka Image File:Exif Array","Omeka Image File:IPTC String","Omeka Image File:IPTC Array","Omeka Video File:Bitrate","Omeka Video File:Duration","Omeka Video File:Sample Rate","Omeka Video File:Codec","Omeka Video File:Width","Omeka Video File:Height","PDF Text:Text","Users Elements:Test","Test Elements:Test",tags,file,itemType,collection,public,featured
83121,https://lebanesestudies.omeka.chass.ncsu.edu/items/show/83121,,,,,,,,,,,,,,,,,,,,,,,,,,,,,,,,,,,,,,,,,"Correspondence from E.B. Williams to Florida Governor Carlton Regarding Failure to Arrest a Criminal ","Lynching--Florida^^ Racism","Content Warning: Materials in this collection contain harmful content, including racist and white supremacist language, graphic descriptions of lynching, and other forms of violence.^^A series of letters from E.B. William's of Madison County, Florida reguarding a situation where the sheriff of Madison County and the sheriff (Douglass) of Columbia County failed to arrest W.L. Haines who was convicted of operating an automobile while intoxicated. Each sheriff claims the man cannot be found in their county, when at given points he was known to be present. Williams claims that ""both of these Sheriffs are liars"" and implies that they are deliberately avoiding making the arrest.",,,"Moise A. Khayrallah Center for Lebanese Diaspora Studies","1929 October 18",,"The donor retains full ownership of any copyright and rights currently controlled. Nonexclusive right to authorize uses of these materials for non-commercial research, scholarly, or other educational purposes are granted to Khayrallah Center pursuant to U.S. Copyright Law. Usage of the materials for these purposes must be fully credited with the source. The user assumes full responsibility for any use of the materials.",,Text/pdf,English,Text,kc0046_19291018_corruption_8,,,,,,,,,,,,,,,,,,,,,,,,,,,,,,,,,,,,,,,,,,,,,,,,,,,,,,,,,,,,,,,,,,,,,,,,,,,,,,"1920s,Crime,Florida,Letters-English",https://lebanesestudies.omeka.chass.ncsu.edu/files/original/5cea66fbfa35e79ead7b5e7535b6edf1.pdf,,"The Romey Lynchings: A Story of Lebanese Immigrants Collection",1,0
83120,https://lebanesestudies.omeka.chass.ncsu.edu/items/show/83120,,,,,,,,,,,,,,,,,,,,,,,,,,,,,,,,,,,,,,,,,"Correspondence from Mrs. W.J. Howell to Florida Governor Carlton Regarding Arson","Lynching--Florida^^ Racism","Content Warning: Materials in this collection contain harmful content, including racist and white supremacist language, graphic descriptions of lynching, and other forms of violence.^^A series of letters reguarding the arson attempts on a business in Fort White, Florida in Columbia County. Mrs. W.J. Howell writes the governor asking him to investigate the matter as the County Sheriff Douglass has failed to adequately investigate. Carlton contacts Douglass who claims he has looked into the matter. However, Mrs. Howell indicates that she believes Douglass is deliberately avoiding his duties as he continously claims more evidence needs to be provided for a warrant.",,,"Moise A. Khayrallah Center for Lebanese Diaspora Studies","1929 June",,"The donor retains full ownership of any copyright and rights currently controlled. Nonexclusive right to authorize uses of these materials for non-commercial research, scholarly, or other educational purposes are granted to Khayrallah Center pursuant to U.S. Copyright Law. Usage of the materials for these purposes must be fully credited with the source. The user assumes full responsibility for any use of the materials.",,Text/pdf,English,Text,kc0046_192906_corruption_9,,,,,,,,,,,,,,,,,,,,,,,,,,,,,,,,,,,,,,,,,,,,,,,,,,,,,,,,,,,,,,,,,,,,,,,,,,,,,,"1920s,Crime,Florida,Letters-English",https://lebanesestudies.omeka.chass.ncsu.edu/files/original/5e87fa7c06817720b8fa440d9c8fc2e4.pdf,,"The Romey Lynchings: A Story of Lebanese Immigrants Collection",1,0
82968,https://lebanesestudies.omeka.chass.ncsu.edu/items/show/82968,,,,,,,,,,,,,,,,,,,,,,,,,,,,,,,,,,,,,,,,,"Joseph Oussani in Swimsuit Miami Beach, 1931","Lebanese--United States^^ Photographs^^ Families","A photograph of an older Joseph Oussani posing in a swimsuit at Miami Beach.",,"Oussani Fuleihan family","Moise A. Khayrallah Center for Lebanese Diaspora Studies",1931,,"The donor retains full ownership of any copyright and rights currently controlled. Nonexclusive right to authorize uses of these materials for non-commercial research, scholarly, or other educational purposes are granted to Khayrallah Center pursuant to U.S. Copyright Law. Usage of the materials for these purposes must be fully credited with the source. The user assumes full responsibility for any use of the materials.",,Image/pdf,,Image,Oussani2018-0129,,,,,,,,,,,,,,,,,,,,,,,,,,,,,,,,,,,,,,,,,,,,,,,,,,,,,,,,,,,,,,,,,,,,,,,,,,,,,,"1930s,Florida",https://lebanesestudies.omeka.chass.ncsu.edu/files/original/ebd8a0fa205c4f62fd73da59c42effa3.pdf,,"Oussani and Fuleihan Family Papers Series 2: Photographs",1,0
82893,https://lebanesestudies.omeka.chass.ncsu.edu/items/show/82893,,,,,,,,,,,,,,,,,,,,,,,,,,,,,,,,,,,,,,,,,"Dorothy and Neville Fuleihan with Two Others on Bikes, 1938","Lebanese--United States^^ Photographs^^ Families","A photograph of a group of kids on bicycles, labeled as ""Jeanette Gaban, Beverly Brown, Neville, and me,"" in St. Petersburg, Florida.",,"Oussani Fuleihan family","Moise A. Khayrallah Center for Lebanese Diaspora Studies",1938,,"The donor retains full ownership of any copyright and rights currently controlled. Nonexclusive right to authorize uses of these materials for non-commercial research, scholarly, or other educational purposes are granted to Khayrallah Center pursuant to U.S. Copyright Law. Usage of the materials for these purposes must be fully credited with the source. The user assumes full responsibility for any use of the materials.",,Image/pdf,English,Image,Oussani2018-0204,,,,,,,,,,,,,,,,,,,,,,,,,,,,,,,,,,,,,,,,,,,,,,,,,,,,,,,,,,,,,,,,,,,,,,,,,,,,,,"1930s,Florida,Recreation",https://lebanesestudies.omeka.chass.ncsu.edu/files/original/85a314498b7ac323be7c19c3d9617dc5.pdf,,"Oussani and Fuleihan Family Papers Series 2: Photographs",1,0
82540,https://lebanesestudies.omeka.chass.ncsu.edu/items/show/82540,,,,,,,,,,,,,,,,,,,,,,,,,,,,,,,,,,,,,,,,,"Neville Fuleihan on Bicycle, 1938","Lebanese--United States^^ Photographs^^ Families","A photograph of Neville Fuleihan on a bicycle in St. Petersburg, Florida.",,"Oussani Fuleihan family","Moise A. Khayrallah Center for Lebanese Diaspora Studies",1938,,"The donor retains full ownership of any copyright and rights currently controlled. Nonexclusive right to authorize uses of these materials for non-commercial research, scholarly, or other educational purposes are granted to Khayrallah Center pursuant to U.S. Copyright Law. Usage of the materials for these purposes must be fully credited with the source. The user assumes full responsibility for any use of the materials.",,Image/pdf,English,Image,Oussani2018-0680,,,,,,,,,,,,,,,,,,,,,,,,,,,,,,,,,,,,,,,,,,,,,,,,,,,,,,,,,,,,,,,,,,,,,,,,,,,,,,"1930s,Florida,Recreation",https://lebanesestudies.omeka.chass.ncsu.edu/files/original/26506fa5d4595c5120fe38980a221252.pdf,,"Oussani and Fuleihan Family Papers Series 2: Photographs",1,0
82539,https://lebanesestudies.omeka.chass.ncsu.edu/items/show/82539,,,,,,,,,,,,,,,,,,,,,,,,,,,,,,,,,,,,,,,,,"Neville Fuleihan and Douglas Ritchie, 1938","Lebanese--United States^^ Photographs^^ Families","A photograph of Neville Fuleihan and Douglas Ritchie in St. Petersburg, Florida.",,"Oussani Fuleihan family","Moise A. Khayrallah Center for Lebanese Diaspora Studies",1938,,"The donor retains full ownership of any copyright and rights currently controlled. Nonexclusive right to authorize uses of these materials for non-commercial research, scholarly, or other educational purposes are granted to Khayrallah Center pursuant to U.S. Copyright Law. Usage of the materials for these purposes must be fully credited with the source. The user assumes full responsibility for any use of the materials.",,Image/pdf,English,Image,Oussani2018-0681,,,,,,,,,,,,,,,,,,,,,,,,,,,,,,,,,,,,,,,,,,,,,,,,,,,,,,,,,,,,,,,,,,,,,,,,,,,,,,"1930s,Florida,Recreation",https://lebanesestudies.omeka.chass.ncsu.edu/files/original/f079f0975dffd56a37fa0473462cc598.pdf,,"Oussani and Fuleihan Family Papers Series 2: Photographs",1,0
81654,https://lebanesestudies.omeka.chass.ncsu.edu/items/show/81654,,,,,,,,,,,,,,,,,,,,,,,,,,,,,,,,,,,,,,,,,"George Kahdy and Nell Kahdy Standing on the Beach","Lebanese--United States^^ Photographs","George Kahdy with Nell Kahdy whose face is tucked away as she hugs him. Caption on the front at the top reads, ""1945. Milton, Fla."" ",,"Barbara Kahdy Estes","Moise A. Khayrallah Center for Lebanese Diaspora Studies",1945,,"The donor retains full ownership of any copyright and rights currently controlled. Nonexclusive right to authorize uses of these materials for non-commercial research, scholarly, or other educational purposes are granted to Khayrallah Center pursuant to U.S. Copyright Law. Usage of the materials for these purposes must be fully credited with the source. The user assumes full responsibility for any use of the materials.",,Image/pdf,"English ",Image,Kahdy2019_093,,,,,,,,,,,,,,,,,,,,,,,,,,,,,,,,,,,,,,,,,,,,,,,,,,,,,,,,,,,,,,,,,,,,,,,,,,,,,,"1940s,Florida",https://lebanesestudies.omeka.chass.ncsu.edu/files/original/84799cb81cc3fa1223279607a2965aee.pdf,,"Kahdy and Wehbie Family Papers",1,0
81069,https://lebanesestudies.omeka.chass.ncsu.edu/items/show/81069,,,,,,,,,,,,,,,,,,,,,,,,,,,,,,,,,,,,,,,,,"Genevieve R. Joseph and Philip White in Florida","Lebanese Americans^^ Photographs","Photograph of Genevieve R. Joseph with her spouse Philip White in Florida.",,"Genevieve Rose Joseph","Moise A. Khayrallah Center for Lebanese Diaspora Studies","circa 2000s",,"The donor retains full ownership of any copyright and rights currently controlled. Nonexclusive right to authorize uses of these materials for non-commercial research, scholarly, or other educational purposes are granted to Khayrallah Center pursuant to U.S. Copyright Law. Usage of the materials for these purposes must be fully credited with the source. The user assumes full responsibility for any use of the materials.",,Image/pdf,English,Image,kc0062_3_3_012,,,,,,,,,,,,,,,,,,,,,,,,,,,,,,,,,,,,,,,,,,,,,,,,,,,,,,,,,,,,,,,,,,,,,,,,,,,,,,"2000s,Florida,Travel",https://lebanesestudies.omeka.chass.ncsu.edu/files/original/962637d643a27c0e031d6869403e6e03.pdf,,"Joseph Family Papers",1,1
81061,https://lebanesestudies.omeka.chass.ncsu.edu/items/show/81061,,,,,,,,,,,,,,,,,,,,,,,,,,,,,,,,,,,,,,,,,"Photograph of Genevieve Norman Joseph and Genevieve R. Joseph Dancing","Lebanese Americans^^ Photographs","Photographs of mother Genevieve Norman Joseph and daughter Genevieve R. Joseph dancing together at the wedding reception of Adam and Tammy in Florida.",,"Genevieve Rose Joseph","Moise A. Khayrallah Center for Lebanese Diaspora Studies","2002 Mar 2",,"The donor retains full ownership of any copyright and rights currently controlled. Nonexclusive right to authorize uses of these materials for non-commercial research, scholarly, or other educational purposes are granted to Khayrallah Center pursuant to U.S. Copyright Law. Usage of the materials for these purposes must be fully credited with the source. The user assumes full responsibility for any use of the materials.",,Image/pdf,English,Image,kc0062_3_3_004,,,,,,,,,,,,,,,,,,,,,,,,,,,,,,,,,,,,,,,,,,,,,,,,,,,,,,,,,,,,,,,,,,,,,,,,,,,,,,"2000s,Dance,Events,Families,Florida,Weddings",https://lebanesestudies.omeka.chass.ncsu.edu/files/original/d65ab4472f5df6e02d4165aa588033aa.pdf,,"Joseph Family Papers",1,1
77768,https://lebanesestudies.omeka.chass.ncsu.edu/items/show/77768,,,,,,,,,,,,,,,,,,,,,,,,,,,,,,,,,,,,,,,,,"Dad with Cousin, Rod Nasby, in Ft. Lauderdale, FL ","Lebanese--United States^^ Photographs","Two cousins standing together in front of a palm tree in Ft. Lauderdale, Florida.",,"Dahr Tanoury","Moise A. Khayrallah Center for Lebanese Diaspora Studies","1955 Feb",,"The donor retains full ownership of any copyright and rights currently controlled. Nonexclusive right to authorize uses of these materials for non-commercial research, scholarly, or other educational purposes are granted to Khayrallah Center pursuant to U.S. Copyright Law. Usage of the materials for these purposes must be fully credited with the source. The user assumes full responsibility for any use of the materials.",,Image/jpg,,Image,kc0015_017,,,,,,,,,,,,,,,,,,,,,,,,,,,,,,,,,,,,,,,,,,,,,,,,,,,,,,,,,,,,,,,,,,,,,,,,,,,,,,"1950s,Families,Florida",https://lebanesestudies.omeka.chass.ncsu.edu/files/original/dc41fb8d07534335045bd71a4ec0f20a.jpg,,"Tanoury Family Papers",1,0
76906,https://lebanesestudies.omeka.chass.ncsu.edu/items/show/76906,,,,,,,,,,,,,,,,,,,,,,,,,,,,,,,,,,,,,,,,,"Epiphany Catholic Church, Lake City, Florida","Lebanese--United States^^ Photographs","The original structure of Epiphany Catholic Church in Lake City, Florida. An inscription on the back says, ""Epiphany Catholic Church Catholic Church Lake City, FL"". The handwriting of the first three words appears different than that of the last five. A yellow note from Sandra Moses Ryland says ""Fannie + Jo raised money to build + support church."" The words ""build"" is crossed out. In the bottom right corner, the note reads, ""Get this reduced.""",,"Sandra Moses Ryland","Moise A. Khayrallah Center for Lebanese Diaspora Studies",undated,,"The donor retains full ownership of any copyright and rights currently controlled. Nonexclusive right to authorize uses of these materials for non-commercial research, scholarly, or other educational purposes are granted to Khayrallah Center pursuant to U.S. Copyright Law. Usage of the materials for these purposes must be fully credited with the source. The user assumes full responsibility for any use of the materials.",,Image/jpg,English,Image,Moses2019007,,,,,,,,,,,,,,,,,,,,,,,,,,,,,,,,,,,,,,,,,,,,,,,,,,,,,,,,,,,,,,,,,,,,,,,,,,,,,,"Catholic Church,Catholicism,Florida",https://lebanesestudies.omeka.chass.ncsu.edu/files/original/bb5861506decc8ad2ece3d3cb059a877.pdf,,"Moses and Romey Family Papers",1,0
76896,https://lebanesestudies.omeka.chass.ncsu.edu/items/show/76896,,,,,,,,,,,,,,,,,,,,,,,,,,,,,,,,,,,,,,,,,"Lucile, Emeline, and Leila Romey, 1950s","Lebanese--United States^^ Photographs","Left to right: Lucile, Emeline, and Leila Romey, in the early 1950s in Daytona Beach, Florida. A notation on the back reads, ""Early 1950s Not Sure Lucile Emeline + Leila Daytona Beach Fla Joe treated Lucile + Leila to a 5 day trip"".",,"Sandra Moses Ryland","Moise A. Khayrallah Center for Lebanese Diaspora Studies","circa 1950s",,"The donor retains full ownership of any copyright and rights currently controlled. Nonexclusive right to authorize uses of these materials for non-commercial research, scholarly, or other educational purposes are granted to Khayrallah Center pursuant to U.S. Copyright Law. Usage of the materials for these purposes must be fully credited with the source. The user assumes full responsibility for any use of the materials.",,Image/jpg,English,Image,Moses2019017,,,,,,,,,,,,,,,,,,,,,,,,,,,,,,,,,,,,,,,,,,,,,,,,,,,,,,,,,,,,,,,,,,,,,,,,,,,,,,"1950s,Families,Florida",https://lebanesestudies.omeka.chass.ncsu.edu/files/original/14d62246fecf500eea34e1223f919af5.pdf,,"Moses and Romey Family Papers",1,0
76895,https://lebanesestudies.omeka.chass.ncsu.edu/items/show/76895,,,,,,,,,,,,,,,,,,,,,,,,,,,,,,,,,,,,,,,,,"Moses Home at 608 North Alachua Street, Lake City, Florida","Lebanese--United States^^ Photographs","A copy of a photograph of the Romey home located at 608 N. Alachua St. in Lake City, Florida. The family moved to this house after relocated back to Lake City from Birmingham, Alabama, where they had moved after the deaths of Nola and Fannie Romey.",,"Sandra Moses Ryland","Moise A. Khayrallah Center for Lebanese Diaspora Studies",undated,,"The donor retains full ownership of any copyright and rights currently controlled. Nonexclusive right to authorize uses of these materials for non-commercial research, scholarly, or other educational purposes are granted to Khayrallah Center pursuant to U.S. Copyright Law. Usage of the materials for these purposes must be fully credited with the source. The user assumes full responsibility for any use of the materials.",,Image/jpg,English,Image,Moses2019018,,,,,,,,,,,,,,,,,,,,,,,,,,,,,,,,,,,,,,,,,,,,,,,,,,,,,,,,,,,,,,,,,,,,,,,,,,,,,,Florida,https://lebanesestudies.omeka.chass.ncsu.edu/files/original/2570a6566458ad66dd481e77ff8e51d6.pdf,,"Moses and Romey Family Papers",1,0
76889,https://lebanesestudies.omeka.chass.ncsu.edu/items/show/76889,,,,,,,,,,,,,,,,,,,,,,,,,,,,,,,,,,,,,,,,,"Photograph of Family Outside","Lebanese--United States^^ Photographs","Members of the Moses family standing outside by a picket fence and a tree at their home on Alachua St., Lake City, Florida. A yellow note attached says ""Helen?/ Ellis/ Fannie/ Amelia/ Alachua St."" The people in the photo from left to right are: Helen Moses, Fannie Moses, Ellis Moses, and Amelia Moses.",,"Sandra Moses Ryland","Moise A. Khayrallah Center for Lebanese Diaspora Studies",undated,,"The donor retains full ownership of any copyright and rights currently controlled. Nonexclusive right to authorize uses of these materials for non-commercial research, scholarly, or other educational purposes are granted to Khayrallah Center pursuant to U.S. Copyright Law. Usage of the materials for these purposes must be fully credited with the source. The user assumes full responsibility for any use of the materials.",,Image/jpg,English,Image,Moses2019024,,,,,,,,,,,,,,,,,,,,,,,,,,,,,,,,,,,,,,,,,,,,,,,,,,,,,,,,,,,,,,,,,,,,,,,,,,,,,,"Families,Florida,portrait",https://lebanesestudies.omeka.chass.ncsu.edu/files/original/2e537ae7ed4926c85b9919efe5cb4a9e.pdf,,"Moses and Romey Family Papers",1,0
76856,https://lebanesestudies.omeka.chass.ncsu.edu/items/show/76856,,,,,,,,,,,,,,,,,,,,,,,,,,,,,,,,,,,,,,,,,"Norman and Telka Clifford Moses","Lebanese--United States^^ Photographs","Norman and his wife Telka Clifford Moses taken in November 1991 at Bluewater Bay, Florida.",,"Sandra Moses Ryland","Moise A. Khayrallah Center for Lebanese Diaspora Studies","1991 November",,"The donor retains full ownership of any copyright and rights currently controlled. Nonexclusive right to authorize uses of these materials for non-commercial research, scholarly, or other educational purposes are granted to Khayrallah Center pursuant to U.S. Copyright Law. Usage of the materials for these purposes must be fully credited with the source. The user assumes full responsibility for any use of the materials.",,Image/jpg,,Image,Moses2019057,,,,,,,,,,,,,,,,,,,,,,,,,,,,,,,,,,,,,,,,,,,,,,,,,,,,,,,,,,,,,,,,,,,,,,,,,,,,,,"1990s,Florida",https://lebanesestudies.omeka.chass.ncsu.edu/files/original/e1e1041cd01e3749764c27a82f57d16b.pdf,,"Moses and Romey Family Papers",1,0
76854,https://lebanesestudies.omeka.chass.ncsu.edu/items/show/76854,,,,,,,,,,,,,,,,,,,,,,,,,,,,,,,,,,,,,,,,,"Moses Siblings, 1984","Lebanese--United States^^ Photographs","Left to right: Helen Moses Bishop, Norman Moses, Telka Clifford Moses (Norman's wife), and Sally Moses in 1984 at the home of Norman and Telka Moses in Fort Walton Beach, FL. A note on the back says ""Helen Norm me Sally &gt^^ Summer '84"".",,"Sandra Moses Ryland","Moise A. Khayrallah Center for Lebanese Diaspora Studies",1984,,"The donor retains full ownership of any copyright and rights currently controlled. Nonexclusive right to authorize uses of these materials for non-commercial research, scholarly, or other educational purposes are granted to Khayrallah Center pursuant to U.S. Copyright Law. Usage of the materials for these purposes must be fully credited with the source. The user assumes full responsibility for any use of the materials.",,Image/jpg,English,Image,Moses2019059,,,,,,,,,,,,,,,,,,,,,,,,,,,,,,,,,,,,,,,,,,,,,,,,,,,,,,,,,,,,,,,,,,,,,,,,,,,,,,"1980s,Florida",https://lebanesestudies.omeka.chass.ncsu.edu/files/original/cc16d1107a00486b8a83502beea39d1c.pdf,,"Moses and Romey Family Papers",1,0