﻿"Item Id","Item URI","Dublin Core:Alternative Title","Dublin Core:Abstract","Dublin Core:Table Of Contents","Dublin Core:Date Available","Dublin Core:Date Created","Dublin Core:Date Accepted","Dublin Core:Date Copyrighted","Dublin Core:Date Submitted","Dublin Core:Date Issued","Dublin Core:Date Modified","Dublin Core:Date Valid","Dublin Core:Access Rights","Dublin Core:License","Dublin Core:Conforms To","Dublin Core:Has Format","Dublin Core:Has Part","Dublin Core:Has Version","Dublin Core:Is Format Of","Dublin Core:Is Part Of","Dublin Core:Is Referenced By","Dublin Core:Is Replaced By","Dublin Core:Is Required By","Dublin Core:Is Version Of","Dublin Core:References","Dublin Core:Replaces","Dublin Core:Requires","Dublin Core:Extent","Dublin Core:Medium","Dublin Core:Bibliographic Citation","Dublin Core:Spatial Coverage","Dublin Core:Temporal Coverage","Dublin Core:Accrual Method","Dublin Core:Accrual Periodicity","Dublin Core:Accrual Policy","Dublin Core:Audience","Dublin Core:Audience Education Level","Dublin Core:Mediator","Dublin Core:Instructional Method","Dublin Core:Provenance","Dublin Core:Rights Holder","Dublin Core:Title","Dublin Core:Subject","Dublin Core:Description","Dublin Core:Creator","Dublin Core:Source","Dublin Core:Publisher","Dublin Core:Date","Dublin Core:Contributor","Dublin Core:Rights","Dublin Core:Relation","Dublin Core:Format","Dublin Core:Language","Dublin Core:Type","Dublin Core:Identifier","Dublin Core:Coverage","Item Type Metadata:Text","Item Type Metadata:Interviewer","Item Type Metadata:Interviewee","Item Type Metadata:Location","Item Type Metadata:Transcription","Item Type Metadata:Local URL","Item Type Metadata:Original Format","Item Type Metadata:Physical Dimensions","Item Type Metadata:Duration","Item Type Metadata:Compression","Item Type Metadata:Producer","Item Type Metadata:Director","Item Type Metadata:Bit Rate/Frequency","Item Type Metadata:Time Summary","Item Type Metadata:Email Body","Item Type Metadata:Subject Line","Item Type Metadata:From","Item Type Metadata:To","Item Type Metadata:CC","Item Type Metadata:BCC","Item Type Metadata:Number of Attachments","Item Type Metadata:Standards","Item Type Metadata:Objectives","Item Type Metadata:Materials","Item Type Metadata:Lesson Plan Text","Item Type Metadata:URL","Item Type Metadata:Event Type","Item Type Metadata:Participants","Item Type Metadata:Birth Date","Item Type Metadata:Birthplace","Item Type Metadata:Death Date","Item Type Metadata:Occupation","Item Type Metadata:Biographical Text","Item Type Metadata:Bibliography","Item Type Metadata:First Name (English)","Item Type Metadata:Last Name (English)","Item Type Metadata:Address","Item Type Metadata:City","Item Type Metadata:State","Item Type Metadata:Business (English)","Item Type Metadata:Provenance (English)","Item Type Metadata:Provenance (Arabic)","Item Type Metadata:Business (Arabic)","Item Type Metadata:Last Name (Arabic)","Item Type Metadata:First Name (Arabic)","Item Type Metadata:Player","Omeka Legacy File:Additional Creator","Omeka Legacy File:Transcriber","Omeka Legacy File:Producer","Omeka Legacy File:Render Device","Omeka Legacy File:Render Details","Omeka Legacy File:Capture Date","Omeka Legacy File:Capture Device","Omeka Legacy File:Capture Details","Omeka Legacy File:Change History","Omeka Legacy File:Watermark","Omeka Legacy File:Encryption","Omeka Legacy File:Compression","Omeka Legacy File:Post Processing","Omeka Image File:Width","Omeka Image File:Height","Omeka Image File:Bit Depth","Omeka Image File:Channels","Omeka Image File:Exif String","Omeka Image File:Exif Array","Omeka Image File:IPTC String","Omeka Image File:IPTC Array","Omeka Video File:Bitrate","Omeka Video File:Duration","Omeka Video File:Sample Rate","Omeka Video File:Codec","Omeka Video File:Width","Omeka Video File:Height","PDF Text:Text","Users Elements:Test","Test Elements:Test",tags,file,itemType,collection,public,featured
68484,https://lebanesestudies.omeka.chass.ncsu.edu/items/show/68484,,,,,,,,,,,,,,,,,,,,,,,,,,,,,,,,,,,,,,,,,"Letter and Envelope from Angele Ellis to Kail Ellis, 1981 April 10","Letter writing, English^^ Letter writing, Arabic^^ Correspondence","A letter and envelope from Angele Ellis to Kail Ellis, dated 1981 April 10. Angele tells Kail that she will call family in Lebanon then changes her mind. At the end, she wrote that she didn't have time to write about the 'tape', then mentioned the nice weather. ","Angele Ellis","Kail Ellis","Moise A. Khayrallah Center for Lebanese Diaspora Studies",1981-04-10,,"Donor retains full ownership of any and all copyright currently controlled in agreement with Khayrallah Center. Nonexclusive right to authorize all uses of these materials for non-commercial research, scholarly, or other educational purposes are granted to Khayrallah Center pursuant to Creative Commons Attribution-NonCommercial-ShareAlike (CC BY-NC-SA).",,Image/pdf,"English, Arabic",Text,KEllis2020-157,,,,,,,,,,,,,,,,,,,,,,,,,,,,,,,,,,,,,,,,,,,,,,,,,,,,,,,,,,,,,,,,,,,,,,,,,,,,,,"1980s,Carthage, NY,Kail Ellis",https://lebanesestudies.omeka.chass.ncsu.edu/files/original/2c38c0008ad66d1dbd04e3ae5d5d5fd6.pdf,,"Angele Hobeiche Kmeid-Ellis Collection: Correspondence",1,1
68482,https://lebanesestudies.omeka.chass.ncsu.edu/items/show/68482,,,,,,,,,,,,,,,,,,,,,,,,,,,,,,,,,,,,,,,,,"Letter and Envelope from Sr. Marie Angele to Kail Ellis, 1981 May 7","Letter writing, English^^ Correspondence","A letter and envelope addressed to Rev. C. Ellis from Sister Marie Angele, dated 1981 May 7.","Marie Angele","Kail Ellis","Moise A. Khayrallah Center for Lebanese Diaspora Studies",1981-05-07,,"Donor retains full ownership of any and all copyright currently controlled in agreement with Khayrallah Center. Nonexclusive right to authorize all uses of these materials for non-commercial research, scholarly, or other educational purposes are granted to Khayrallah Center pursuant to Creative Commons Attribution-NonCommercial-ShareAlike (CC BY-NC-SA).",,Image/pdf,English,Text,KEllis2020-159,,,,,,,,,,,,,,,,,,,,,,,,,,,,,,,,,,,,,,,,,,,,,,,,,,,,,,,,,,,,,,,,,,,,,,,,,,,,,,"1980s,Carthage, NY,Kail Ellis,Sister Marie Angele",https://lebanesestudies.omeka.chass.ncsu.edu/files/original/7eef83f4f85ad03432e902bf55a4a308.pdf,,"Angele Hobeiche Kmeid-Ellis Collection: Correspondence",1,1
68481,https://lebanesestudies.omeka.chass.ncsu.edu/items/show/68481,,,,,,,,,,,,,,,,,,,,,,,,,,,,,,,,,,,,,,,,,"Envelope and Postcard from Angele Ellis to Kail Ellis, 1981 July 17","Postcards^^ Correspondence","An envelope and 3D postcard addressed from Angele Ellis to Kail Ellis, dated 1981 July 17. Arabic below: locations of where 'bombs are falling' in Ghazir, Kfour, Boqaata, and Mazra'a in Lebanon. ","Angele Ellis","Kail Ellis","Moise A. Khayrallah Center for Lebanese Diaspora Studies",1981-07-17,,"Donor retains full ownership of any and all copyright currently controlled in agreement with Khayrallah Center. Nonexclusive right to authorize all uses of these materials for non-commercial research, scholarly, or other educational purposes are granted to Khayrallah Center pursuant to Creative Commons Attribution-NonCommercial-ShareAlike (CC BY-NC-SA).",,Image/pdf,"English, Arabic",Text,KEllis2020-160,,,,,,,,,,,,,,,,,,,,,,,,,,,,,,,,,,,,,,,,,,,,,,,,,,,,,,,,,,,,,,,,,,,,,,,,,,,,,,"1980s,Angele Ellis,Carthage, NY,Christ at Gethsemane,Kail Ellis,Postcards",https://lebanesestudies.omeka.chass.ncsu.edu/files/original/4193295c82d3442882e14dc6c3c4446d.pdf,,"Angele Hobeiche Kmeid-Ellis Collection: Correspondence",1,1
68480,https://lebanesestudies.omeka.chass.ncsu.edu/items/show/68480,,,,,,,,,,,,,,,,,,,,,,,,,,,,,,,,,,,,,,,,,"Envelope and Letter from Angele Ellis to Kail Ellis, 1981 August 25","Letter writing, English^^ Letter writing, Arabic^^ Correspondence","An envelope and letter addressed from Angele Ellis to Kail Ellis dated 1981 August 25. Arabic on top: Angele informs Kail all is good, she lost his 'tape', Delore has a bad back pain. ","Angele Ellis","Kail Ellis","Moise A. Khayrallah Center for Lebanese Diaspora Studies",1981-08-25,,"Donor retains full ownership of any and all copyright currently controlled in agreement with Khayrallah Center. Nonexclusive right to authorize all uses of these materials for non-commercial research, scholarly, or other educational purposes are granted to Khayrallah Center pursuant to Creative Commons Attribution-NonCommercial-ShareAlike (CC BY-NC-SA).",,Image/pdf,"English, Arabic",Text,KEllis2020-161,,,,,,,,,,,,,,,,,,,,,,,,,,,,,,,,,,,,,,,,,,,,,,,,,,,,,,,,,,,,,,,,,,,,,,,,,,,,,,"Angele Ellis,Carthage, NY,Kail Ellis",https://lebanesestudies.omeka.chass.ncsu.edu/files/original/d475cd7b4da4e624ac9c998f7f8fba77.pdf,,"Angele Hobeiche Kmeid-Ellis Collection: Correspondence",1,1
68479,https://lebanesestudies.omeka.chass.ncsu.edu/items/show/68479,,,,,,,,,,,,,,,,,,,,,,,,,,,,,,,,,,,,,,,,,"Envelope to Kail Ellis, 1981 September 14","Letter writing, English^^ Correspondence","An envelope addressed to Rev. Kail C. Ellis dated 1981 September 14.",,"Kail Ellis","Moise A. Khayrallah Center for Lebanese Diaspora Studies",1981-09-14,,"Donor retains full ownership of any and all copyright currently controlled in agreement with Khayrallah Center. Nonexclusive right to authorize all uses of these materials for non-commercial research, scholarly, or other educational purposes are granted to Khayrallah Center pursuant to Creative Commons Attribution-NonCommercial-ShareAlike (CC BY-NC-SA).",,Image/pdf,English,Text,KEllis2020-162,,,,,,,,,,,,,,,,,,,,,,,,,,,,,,,,,,,,,,,,,,,,,,,,,,,,,,,,,,,,,,,,,,,,,,,,,,,,,,"1980s,Carthage, NY,Kail Ellis",https://lebanesestudies.omeka.chass.ncsu.edu/files/original/520f0935bf836ff3459ca008fe730750.pdf,,"Angele Hobeiche Kmeid-Ellis Collection: Correspondence",1,1
68478,https://lebanesestudies.omeka.chass.ncsu.edu/items/show/68478,,,,,,,,,,,,,,,,,,,,,,,,,,,,,,,,,,,,,,,,,"Envelope and Letter from Angele Ellis to Kail Ellis, 1981 September 18","Letter writing, English^^ Letter writing, Arabic^^ Correspondence","An envelope and letter addressed to Rev. Kail C. Ellis from Mrs. Angele Ellis dated 1981 September 18. Arabic on top: Angele as happy to hear Kail voice on the phone but forgot to say happy birthday to him, she made a cake and went to mass. Arabic below: all is normal, (Theresa Centrik?) will 'leave' to Rome. ","Angele Ellis","Kail Ellis","Moise A. Khayrallah Center for Lebanese Diaspora Studies",1981-09-18,,"Donor retains full ownership of any and all copyright currently controlled in agreement with Khayrallah Center. Nonexclusive right to authorize all uses of these materials for non-commercial research, scholarly, or other educational purposes are granted to Khayrallah Center pursuant to Creative Commons Attribution-NonCommercial-ShareAlike (CC BY-NC-SA).",,Image/pdf,"English, Arabic",Text,KEllis2020-163,,,,,,,,,,,,,,,,,,,,,,,,,,,,,,,,,,,,,,,,,,,,,,,,,,,,,,,,,,,,,,,,,,,,,,,,,,,,,,"1980s,Angele Ellis,Carthage, NY,Kail Ellis",https://lebanesestudies.omeka.chass.ncsu.edu/files/original/aa1e684c0ba103f53fa030d599049df3.pdf,,"Angele Hobeiche Kmeid-Ellis Collection: Correspondence",1,1
68475,https://lebanesestudies.omeka.chass.ncsu.edu/items/show/68475,,,,,,,,,,,,,,,,,,,,,,,,,,,,,,,,,,,,,,,,,"Envelope and Letter from Angele Ellis to Kail Ellis, 1981 November 16","Letter writing, English^^ Letter writing, Arabic^^ Correspondence","An envelope and letter addressed from Angele Ellis to Kail Ellis, dated 1981 November 16. Arabic on top: Angele is sorry for missing Kail call as she went with Theresa to Karmel. Arabic below: Alfreda bought the house and will do the painting and maintenance. ","Angele Ellis","Kail Ellis","Moise A. Khayrallah Center for Lebanese Diaspora Studies",1981-11-16,,"Donor retains full ownership of any and all copyright currently controlled in agreement with Khayrallah Center. Nonexclusive right to authorize all uses of these materials for non-commercial research, scholarly, or other educational purposes are granted to Khayrallah Center pursuant to Creative Commons Attribution-NonCommercial-ShareAlike (CC BY-NC-SA).",,Image/pdf,"English, Arabic",Text,KEllis2020-165,,,,,,,,,,,,,,,,,,,,,,,,,,,,,,,,,,,,,,,,,,,,,,,,,,,,,,,,,,,,,,,,,,,,,,,,,,,,,,"1980s,Angele Ellis,Carthage, NY,Kail Ellis",https://lebanesestudies.omeka.chass.ncsu.edu/files/original/5708a75526f6d6b082ee59a130199e16.pdf,,"Angele Hobeiche Kmeid-Ellis Collection: Correspondence",1,1
68471,https://lebanesestudies.omeka.chass.ncsu.edu/items/show/68471,,,,,,,,,,,,,,,,,,,,,,,,,,,,,,,,,,,,,,,,,"Letter, and enclosed Valentine's Day Card from Angele and Toufic Ellis to Kail Ellis, 1982 February 12","Valentine's Day Cards^^ Letter writing, English^^ Letter writing, Arabic^^ Correspondence","An envelope with a letter and enclosed Valentine's Day card addressed to Kail Ellis from Toufic and Angele Ellis, dated 1982 February 12. ","Angele Ellis","Kail Ellis","Moise A. Khayrallah Center for Lebanese Diaspora Studies",1982-02-12,,"Donor retains full ownership of any and all copyright currently controlled in agreement with Khayrallah Center. Nonexclusive right to authorize all uses of these materials for non-commercial research, scholarly, or other educational purposes are granted to Khayrallah Center pursuant to Creative Commons Attribution-NonCommercial-ShareAlike (CC BY-NC-SA).",,Image/pdf,"English, Arabic",Text,KEllis2020-169,,,,,,,,,,,,,,,,,,,,,,,,,,,,,,,,,,,,,,,,,,,,,,,,,,,,,,,,,,,,,,,,,,,,,,,,,,,,,,"1980s,Angele Ellis,Carthage, NY,Kail Ellis,Toufic Ellis,Valentine's Day",https://lebanesestudies.omeka.chass.ncsu.edu/files/original/f3ea39be0f7163ea0afaf4d2d530a732.pdf,,"Angele Hobeiche Kmeid-Ellis Collection: Correspondence",1,1
68469,https://lebanesestudies.omeka.chass.ncsu.edu/items/show/68469,,,,,,,,,,,,,,,,,,,,,,,,,,,,,,,,,,,,,,,,,"Letter from Angele Ellis to Kail Ellis, 1982 March 1.","Letter writing, English^^ Letter writing, Arabic^^ Correspondence","A letter addressed from Angele Ellis to Kail Ellis dated 1982 March 1.","Angele Ellis","Kail Ellis","Moise A. Khayrallah Center for Lebanese Diaspora Studies",1982-03-01,,"Donor retains full ownership of any and all copyright currently controlled in agreement with Khayrallah Center. Nonexclusive right to authorize all uses of these materials for non-commercial research, scholarly, or other educational purposes are granted to Khayrallah Center pursuant to Creative Commons Attribution-NonCommercial-ShareAlike (CC BY-NC-SA).",,Image/pdf,"English, Arabic",Text,KEllis2020-170,,,,,,,,,,,,,,,,,,,,,,,,,,,,,,,,,,,,,,,,,,,,,,,,,,,,,,,,,,,,,,,,,,,,,,,,,,,,,,"1980s,Angele Ellis,Carthage, NY,Kail Ellis",https://lebanesestudies.omeka.chass.ncsu.edu/files/original/afcbcb4bdc5b9a3a61fa03b10a52e84b.pdf,,"Angele Hobeiche Kmeid-Ellis Collection: Correspondence",1,1
68466,https://lebanesestudies.omeka.chass.ncsu.edu/items/show/68466,,,,,,,,,,,,,,,,,,,,,,,,,,,,,,,,,,,,,,,,,"Envelope and Letter from Angele Ellis to Kail Ellis, 1982 March 30","Letter writing, English^^ Letter writing, Arabic^^ Correspondence","An envelope and letter addressed from Angele Ellis to Kail Ellis dated 1982 March 30. Arabic on top: Angele is happy that Kail went to his niece wedding. ","Angele Ellis","Kail Ellis","Moise A. Khayrallah Center for Lebanese Diaspora Studies",1982-03-30,,"Donor retains full ownership of any and all copyright currently controlled in agreement with Khayrallah Center. Nonexclusive right to authorize all uses of these materials for non-commercial research, scholarly, or other educational purposes are granted to Khayrallah Center pursuant to Creative Commons Attribution-NonCommercial-ShareAlike (CC BY-NC-SA).",,Image/pdf,"English, Arabic",Text,KEllis2020-172,,,,,,,,,,,,,,,,,,,,,,,,,,,,,,,,,,,,,,,,,,,,,,,,,,,,,,,,,,,,,,,,,,,,,,,,,,,,,,"1980s,Angele Ellis,Carthage, NY,Kail Ellis",https://lebanesestudies.omeka.chass.ncsu.edu/files/original/53fca9dcb706ee1d5d7fa930920c4608.pdf,,"Angele Hobeiche Kmeid-Ellis Collection: Correspondence",1,1
68463,https://lebanesestudies.omeka.chass.ncsu.edu/items/show/68463,,,,,,,,,,,,,,,,,,,,,,,,,,,,,,,,,,,,,,,,,"Letter and Envelope from Angele Ellis to Kail Ellis, 1982 June 22","Letter writing, English^^ Letter writing, Arabic^^ Correspondence","A letter and envelope addressed from Angele Ellis to Kail Ellis, dated 1982 June 22. Angele informs Kail that received the newspaper's article that talk about war in Lebanon. Kmeid in Baabda, the article mentioned George, it is likely to be Joseph. Arabic in middle: translation of the English text about Turkey and France in Lebanon (beneath it). Arabic below: story of boy crying wolf. ","Angele Ellis","Kail Ellis","Moise A. Khayrallah Center for Lebanese Diaspora Studies",1982-06-22,,"Donor retains full ownership of any and all copyright currently controlled in agreement with Khayrallah Center. Nonexclusive right to authorize all uses of these materials for non-commercial research, scholarly, or other educational purposes are granted to Khayrallah Center pursuant to Creative Commons Attribution-NonCommercial-ShareAlike (CC BY-NC-SA).",,Image/pdf,"English, Arabic",Text,KEllis2020-174,,,,,,,,,,,,,,,,,,,,,,,,,,,,,,,,,,,,,,,,,,,,,,,,,,,,,,,,,,,,,,,,,,,,,,,,,,,,,,"1980s,Angele Ellis,Carthage, NY,Kail Ellis",https://lebanesestudies.omeka.chass.ncsu.edu/files/original/b9f8ac317bcc191627b50621b2118b3f.pdf,,"Angele Hobeiche Kmeid-Ellis Collection: Correspondence",1,1
68461,https://lebanesestudies.omeka.chass.ncsu.edu/items/show/68461,,,,,,,,,,,,,,,,,,,,,,,,,,,,,,,,,,,,,,,,,"Letter and Envelope from Angele Ellis to Kail Ellis, 1982 August 20","Letter writing, English^^ Letter writing, Arabic^^ Correspondence","A letter and envelope addressed from Angele Ellis to Kail Ellis, dated 1982 August 20. Arabic below: they went to Taber Lake, Theresa returned to Waterton.  ","Angele Ellis","Kail Ellis","Moise A. Khayrallah Center for Lebanese Diaspora Studies",1982-08-20,,"Donor retains full ownership of any and all copyright currently controlled in agreement with Khayrallah Center. Nonexclusive right to authorize all uses of these materials for non-commercial research, scholarly, or other educational purposes are granted to Khayrallah Center pursuant to Creative Commons Attribution-NonCommercial-ShareAlike (CC BY-NC-SA).",,Image/pdf,"English, Arabic",Text,KEllis2020-176,,,,,,,,,,,,,,,,,,,,,,,,,,,,,,,,,,,,,,,,,,,,,,,,,,,,,,,,,,,,,,,,,,,,,,,,,,,,,,"1980s,Angele Ellis,Carthage, NY,Kail Ellis",https://lebanesestudies.omeka.chass.ncsu.edu/files/original/a6be0c0643fb544c2f87da5123ccbe8c.pdf,,"Angele Hobeiche Kmeid-Ellis Collection: Correspondence",1,1
68460,https://lebanesestudies.omeka.chass.ncsu.edu/items/show/68460,,,,,,,,,,,,,,,,,,,,,,,,,,,,,,,,,,,,,,,,,"Letter and Envelope from Angele Ellis to Kail Ellis, 1982 November 18","Letter writing, English^^ Letter writing, Arabic^^ Correspondence","A letter and envelope addressed from Angele Ellis to Kail Ellis written by Therese, dated 1982 November 18. Arabic section: Theresa in Carthage, Delore and wife came for dinner. ","Angele Ellis","Kail Ellis","Moise A. Khayrallah Center for Lebanese Diaspora Studies",1982-11-18,,"Donor retains full ownership of any and all copyright currently controlled in agreement with Khayrallah Center. Nonexclusive right to authorize all uses of these materials for non-commercial research, scholarly, or other educational purposes are granted to Khayrallah Center pursuant to Creative Commons Attribution-NonCommercial-ShareAlike (CC BY-NC-SA).",,Image/pdf,"English, Arabic",Text,KEllis2020-177,,,,,,,,,,,,,,,,,,,,,,,,,,,,,,,,,,,,,,,,,,,,,,,,,,,,,,,,,,,,,,,,,,,,,,,,,,,,,,"1980s,Angele Ellis,Carthage, NY,Kail Ellis",https://lebanesestudies.omeka.chass.ncsu.edu/files/original/ef4feafd0f60185950ec4c59efd3e66f.pdf,,"Angele Hobeiche Kmeid-Ellis Collection: Correspondence",1,1
68423,https://lebanesestudies.omeka.chass.ncsu.edu/items/show/68423,,,,,,,,,,,,,,,,,,,,,,,,,,,,,,,,,,,,,,,,,"Letter from Senator John M. McHugh to Angele Ellis, 1990 October 24","Letter writing, English^^ Correspondence","A letter to Angele Ellis from New York Senator John M. McHugh, dated 1990 October 24","John M. McHugh","Kail Ellis","Moise A. Khayrallah Center for Lebanese Diaspora Studies",1990-10-24,,"Donor retains full ownership of any and all copyright currently controlled in agreement with Khayrallah Center. Nonexclusive right to authorize all uses of these materials for non-commercial research, scholarly, or other educational purposes are granted to Khayrallah Center pursuant to Creative Commons Attribution-NonCommercial-ShareAlike (CC BY-NC-SA).",,Image/pdf,English,Text,KEllis2020-208,,,,,,,,,,,,,,,,,,,,,,,,,,,,,,,,,,,,,,,,,,,,,,,,,,,,,,,,,,,,,,,,,,,,,,,,,,,,,,"1990s,Angele Ellis,Carthage, NY,John M. McHugh",https://lebanesestudies.omeka.chass.ncsu.edu/files/original/0814b3ae773642a8d83b223f1cd3185a.pdf,,"Angele Hobeiche Kmeid-Ellis Collection: Correspondence",1,1
68354,https://lebanesestudies.omeka.chass.ncsu.edu/items/show/68354,,,,,,,,,,,,,,,,,,,,,,,,,,,,,,,,,,,,,,,,,"Envelope from Angele Ellis to Kail Ellis","Letter writing, English^^ Correspondence","An envelope addressed from Angele Ellis to Kail Ellis","Angele Ellis","Kail Ellis","Moise A. Khayrallah Center for Lebanese Diaspora Studies",,,"Donor retains full ownership of any and all copyright currently controlled in agreement with Khayrallah Center. Nonexclusive right to authorize all uses of these materials for non-commercial research, scholarly, or other educational purposes are granted to Khayrallah Center pursuant to Creative Commons Attribution-NonCommercial-ShareAlike (CC BY-NC-SA).",,Image/pdf,English,Text,KEllis2020-250,,,,,,,,,,,,,,,,,,,,,,,,,,,,,,,,,,,,,,,,,,,,,,,,,,,,,,,,,,,,,,,,,,,,,,,,,,,,,,"Angele Ellis,Carthage, NY,Kail Ellis",https://lebanesestudies.omeka.chass.ncsu.edu/files/original/f0ee0974effd865344ddec19c65cabb8.pdf,,"Angele Hobeiche Kmeid-Ellis Collection: Correspondence",1,1
69089,https://lebanesestudies.omeka.chass.ncsu.edu/items/show/69089,,,,,,,,,,,,,,,,,,,,,,,,,,,,,,,,,,,,,,,,,"Port of Arrival Spreadsheet for Ellis Island",,"A port of arrival spreadsheet for Ellis Island, a highlighted row on this copy mentions Carthage, NY. At the bottom it looks like a search was done for Toufic Ellis. The sheet does not have a year only 'July 29'",,"Kail Ellis","Moise A. Khayrallah Center for Lebanese Diaspora Studies",,,"Donor retains full ownership of any and all copyright currently controlled in agreement with Khayrallah Center. Nonexclusive right to authorize all uses of these materials for non-commercial research, scholarly, or other educational purposes are granted to Khayrallah Center pursuant to Creative Commons Attribution-NonCommercial-ShareAlike (CC BY-NC-SA).",,Text/pdf,English,Text,KEllis2020-823,,,,,,,,,,,,,,,,,,,,,,,,,,,,,,,,,,,,,,,,,,,,,,,,,,,,,,,,,,,,,,,,,,,,,,,,,,,,,,"Carthage, NY",https://lebanesestudies.omeka.chass.ncsu.edu/files/original/1f08615d3b75afc636f0102dffd7701b.pdf,,"Angele Hobeiche Kmeid-Ellis Collection: Supplemental Materials",1,0
