﻿"Item Id","Item URI","Dublin Core:Alternative Title","Dublin Core:Abstract","Dublin Core:Table Of Contents","Dublin Core:Date Available","Dublin Core:Date Created","Dublin Core:Date Accepted","Dublin Core:Date Copyrighted","Dublin Core:Date Submitted","Dublin Core:Date Issued","Dublin Core:Date Modified","Dublin Core:Date Valid","Dublin Core:Access Rights","Dublin Core:License","Dublin Core:Conforms To","Dublin Core:Has Format","Dublin Core:Has Part","Dublin Core:Has Version","Dublin Core:Is Format Of","Dublin Core:Is Part Of","Dublin Core:Is Referenced By","Dublin Core:Is Replaced By","Dublin Core:Is Required By","Dublin Core:Is Version Of","Dublin Core:References","Dublin Core:Replaces","Dublin Core:Requires","Dublin Core:Extent","Dublin Core:Medium","Dublin Core:Bibliographic Citation","Dublin Core:Spatial Coverage","Dublin Core:Temporal Coverage","Dublin Core:Accrual Method","Dublin Core:Accrual Periodicity","Dublin Core:Accrual Policy","Dublin Core:Audience","Dublin Core:Audience Education Level","Dublin Core:Mediator","Dublin Core:Instructional Method","Dublin Core:Provenance","Dublin Core:Rights Holder","Dublin Core:Title","Dublin Core:Subject","Dublin Core:Description","Dublin Core:Creator","Dublin Core:Source","Dublin Core:Publisher","Dublin Core:Date","Dublin Core:Contributor","Dublin Core:Rights","Dublin Core:Relation","Dublin Core:Format","Dublin Core:Language","Dublin Core:Type","Dublin Core:Identifier","Dublin Core:Coverage","Item Type Metadata:Text","Item Type Metadata:Interviewer","Item Type Metadata:Interviewee","Item Type Metadata:Location","Item Type Metadata:Transcription","Item Type Metadata:Local URL","Item Type Metadata:Original Format","Item Type Metadata:Physical Dimensions","Item Type Metadata:Duration","Item Type Metadata:Compression","Item Type Metadata:Producer","Item Type Metadata:Director","Item Type Metadata:Bit Rate/Frequency","Item Type Metadata:Time Summary","Item Type Metadata:Email Body","Item Type Metadata:Subject Line","Item Type Metadata:From","Item Type Metadata:To","Item Type Metadata:CC","Item Type Metadata:BCC","Item Type Metadata:Number of Attachments","Item Type Metadata:Standards","Item Type Metadata:Objectives","Item Type Metadata:Materials","Item Type Metadata:Lesson Plan Text","Item Type Metadata:URL","Item Type Metadata:Event Type","Item Type Metadata:Participants","Item Type Metadata:Birth Date","Item Type Metadata:Birthplace","Item Type Metadata:Death Date","Item Type Metadata:Occupation","Item Type Metadata:Biographical Text","Item Type Metadata:Bibliography","Item Type Metadata:First Name (English)","Item Type Metadata:Last Name (English)","Item Type Metadata:Address","Item Type Metadata:City","Item Type Metadata:State","Item Type Metadata:Business (English)","Item Type Metadata:Provenance (English)","Item Type Metadata:Provenance (Arabic)","Item Type Metadata:Business (Arabic)","Item Type Metadata:Last Name (Arabic)","Item Type Metadata:First Name (Arabic)","Item Type Metadata:Player","Omeka Legacy File:Additional Creator","Omeka Legacy File:Transcriber","Omeka Legacy File:Producer","Omeka Legacy File:Render Device","Omeka Legacy File:Render Details","Omeka Legacy File:Capture Date","Omeka Legacy File:Capture Device","Omeka Legacy File:Capture Details","Omeka Legacy File:Change History","Omeka Legacy File:Watermark","Omeka Legacy File:Encryption","Omeka Legacy File:Compression","Omeka Legacy File:Post Processing","Omeka Image File:Width","Omeka Image File:Height","Omeka Image File:Bit Depth","Omeka Image File:Channels","Omeka Image File:Exif String","Omeka Image File:Exif Array","Omeka Image File:IPTC String","Omeka Image File:IPTC Array","Omeka Video File:Bitrate","Omeka Video File:Duration","Omeka Video File:Sample Rate","Omeka Video File:Codec","Omeka Video File:Width","Omeka Video File:Height","PDF Text:Text","Users Elements:Test","Test Elements:Test",tags,file,itemType,collection,public,featured
68848,https://lebanesestudies.omeka.chass.ncsu.edu/items/show/68848,,,,,,,,,,,,,,,,,,,,,,,,,,,,,,,,,,,,,,,,,"Card from Badia Assaf to Angele Ellis, c. 1951","Correspondence^^ Christmas Cards^^ Christmas","An undated card from Badia Assaf to Angele Ellis circa 1951.","Badia Assaf","Kail Ellis","Moise A. Khayrallah Center for Lebanese Diaspora Studies","1951 c.",,"Donor retains full ownership of any and all copyright currently controlled in agreement with Khayrallah Center. Nonexclusive right to authorize all uses of these materials for non-commercial research, scholarly, or other educational purposes are granted to Khayrallah Center pursuant to Creative Commons Attribution-NonCommercial-ShareAlike (CC BY-NC-SA).",,Text/pdf,Arabic,Text,KEllis2018-334,,,,,,,,,,,,,,,,,,,,,,,,,,,,,,,,,,,,,,,,,,,,,,,,,,,,,,,,,,,,,,,,,,,,,,,,,,,,,,"1950s,Angele Ellis,Badia Assaf,Christmas,Christmas Card,Ellis",https://lebanesestudies.omeka.chass.ncsu.edu/files/original/3b1ab1e8d8ed11cfa8379e5cc48f20af.pdf,,"Angele Hobeiche Kmeid-Ellis Collection: Correspondence",1,1
68932,https://lebanesestudies.omeka.chass.ncsu.edu/items/show/68932,,,,,,,,,,,,,,,,,,,,,,,,,,,,,,,,,,,,,,,,,"Holy Card from Badia Assaf to Angele Ellis, c. 1937","Holy cards^^ Mass cards^^ Prayer cards","A holy card from Badia Assaf to Angele Ellis circa 1937.","Badia Assaf","Kail Ellis","Moise A. Khayrallah Center for Lebanese Diaspora Studies","1937 c.",,"Donor retains full ownership of any and all copyright currently controlled in agreement with Khayrallah Center. Nonexclusive right to authorize all uses of these materials for non-commercial research, scholarly, or other educational purposes are granted to Khayrallah Center pursuant to Creative Commons Attribution-NonCommercial-ShareAlike (CC BY-NC-SA).",,Text/pdf,Arabic,Text,KEllis2018-333,,,,,,,,,,,,,,,,,,,,,,,,,,,,,,,,,,,,,,,,,,,,,,,,,,,,,,,,,,,,,,,,,,,,,,,,,,,,,,"1930s,Angele Ellis,Assaf,Badia Assaf,Ellis,Holy Cards,Prayer Cards",https://lebanesestudies.omeka.chass.ncsu.edu/files/original/af890dd2d355cd24f554576cd5f23a86.pdf,,"Angele Hobeiche Kmeid-Ellis Collection: Correspondence",1,1
69046,https://lebanesestudies.omeka.chass.ncsu.edu/items/show/69046,,,,,,,,,,,,,,,,,,,,,,,,,,,,,,,,,,,,,,,,,"Letter from Badia Assaf to Angele Ellis, 1925 January 1","Letter writing, Arabic^^ Correspondence","A letter from Badia Assaf to Angele Ellis, dated 1 January 1925.","Badia Assaf","Kail Ellis","Moise A. Khayrallah Center for Lebanese Diaspora Studies",1925-01-01,,"Donor retains full ownership of any and all copyright currently controlled in agreement with Khayrallah Center. Nonexclusive right to authorize all uses of these materials for non-commercial research, scholarly, or other educational purposes are granted to Khayrallah Center pursuant to Creative Commons Attribution-NonCommercial-ShareAlike (CC BY-NC-SA).",,Text/pdf,Arabic,Text,KEllis2018-005,,,,,,,,,,,,,,,,,,,,,,,,,,,,,,,,,,,,,,,,,,,,,,,,,,,,,,,,,,,,,,,,,,,,,,,,,,,,,,"1920s,Angele Ellis,Badia Assaf,Ellis,Holiday-Christmas,Holidays,New Year's Eve",https://lebanesestudies.omeka.chass.ncsu.edu/files/original/db3a5ca4fdf159a34881032cd2d75cb5.pdf,,"Angele Hobeiche Kmeid-Ellis Collection: Correspondence",1,1
68992,https://lebanesestudies.omeka.chass.ncsu.edu/items/show/68992,,,,,,,,,,,,,,,,,,,,,,,,,,,,,,,,,,,,,,,,,"Letter from Badia Assaf to Angele Ellis, 1927 September 22","Letter writing, Arabic^^ Correspondence","A letter from Badia Assaf to Angele Ellis, dated 22 September 1927.","Badia Assaf","Kail Ellis","Moise A. Khayrallah Center for Lebanese Diaspora Studies",1927-09-22,,"Donor retains full ownership of any and all copyright currently controlled in agreement with Khayrallah Center. Nonexclusive right to authorize all uses of these materials for non-commercial research, scholarly, or other educational purposes are granted to Khayrallah Center pursuant to Creative Commons Attribution-NonCommercial-ShareAlike (CC BY-NC-SA).",,Text/pdf,Arabic,Text,KEllis2018-055,,,,,,,,,,,,,,,,,,,,,,,,,,,,,,,,,,,,,,,,,,,,,,,,,,,,,,,,,,,,,,,,,,,,,,,,,,,,,,"1920s,Angele Ellis,Badia Assaf,Ellis,Santiago, Cuba",https://lebanesestudies.omeka.chass.ncsu.edu/files/original/6be2fa2fbb4696cdf0845e5469577705.pdf,,"Angele Hobeiche Kmeid-Ellis Collection: Correspondence",1,1
68493,https://lebanesestudies.omeka.chass.ncsu.edu/items/show/68493,,,,,,,,,,,,,,,,,,,,,,,,,,,,,,,,,,,,,,,,,"Letter from Badia Assaf to Angele Ellis, 1980 April 30","Letter writing, Arabic^^ Correspondence","A letter from Badia Assaf to Angele Ellis, dated 30 April 1980.","Badia Assaf","Kail Ellis","Moise A. Khayrallah Center for Lebanese Diaspora Studies",1980-04-30,,"Donor retains full ownership of any and all copyright currently controlled in agreement with Khayrallah Center. Nonexclusive right to authorize all uses of these materials for non-commercial research, scholarly, or other educational purposes are granted to Khayrallah Center pursuant to Creative Commons Attribution-NonCommercial-ShareAlike (CC BY-NC-SA).",,Text/pdf,"Arabic^^ English",Text,KEllis2018-301,,,,,,,,,,,,,,,,,,,,,,,,,,,,,,,,,,,,,,,,,,,,,,,,,,,,,,,,,,,,,,,,,,,,,,,,,,,,,,"1980,1980s,Angele Ellis,Assaf,Badia Assaf,Ellis,Santiago, Cuba",https://lebanesestudies.omeka.chass.ncsu.edu/files/original/e327c335c6579be5ba71fcff26cfc486.pdf,,"Angele Hobeiche Kmeid-Ellis Collection: Correspondence",1,1
68440,https://lebanesestudies.omeka.chass.ncsu.edu/items/show/68440,,,,,,,,,,,,,,,,,,,,,,,,,,,,,,,,,,,,,,,,,"Letter from Badia Assaf to Angele Ellis, 1986 August 20","Letter writing, Arabic^^ Correspondence","A letter from Badia Assaf to Angele Ellis, dated 20 August 1986.","Badia Assaf","Kail Ellis","Moise A. Khayrallah Center for Lebanese Diaspora Studies",1986-08-20,,"Donor retains full ownership of any and all copyright currently controlled in agreement with Khayrallah Center. Nonexclusive right to authorize all uses of these materials for non-commercial research, scholarly, or other educational purposes are granted to Khayrallah Center pursuant to Creative Commons Attribution-NonCommercial-ShareAlike (CC BY-NC-SA).",,Text/pdf,Arabic,Text,KEllis2018-311,,,,,,,,,,,,,,,,,,,,,,,,,,,,,,,,,,,,,,,,,,,,,,,,,,,,,,,,,,,,,,,,,,,,,,,,,,,,,,"1980s,Angele Ellis,Assaf,Badia Assaf,Ellis,Havana, Cuba,Lebanese Civil War",https://lebanesestudies.omeka.chass.ncsu.edu/files/original/291b376d066a72c6fb4fdfa0f3206242.pdf,,"Angele Hobeiche Kmeid-Ellis Collection: Correspondence",1,1
69008,https://lebanesestudies.omeka.chass.ncsu.edu/items/show/69008,,,,,,,,,,,,,,,,,,,,,,,,,,,,,,,,,,,,,,,,,"Letters from Angele Ellis to Friends in Lebanon, 1927 February 28","Letter writing, Arabic^^ Correspondence","A group of letters written by Angele Ellis that were possibly never sent. One letter is addressed to Badia Assaf. One letter is addressed to Farida Habib (spelled Habeeb in document), wife of Elias Habib. One letter is unclearly addressed but, dated 28 February 1927.","Angele Ellis","Kail Ellis","Moise A. Khayrallah Center for Lebanese Diaspora Studies",1927-02-28,,"Donor retains full ownership of any and all copyright currently controlled in agreement with Khayrallah Center. Nonexclusive right to authorize all uses of these materials for non-commercial research, scholarly, or other educational purposes are granted to Khayrallah Center pursuant to Creative Commons Attribution-NonCommercial-ShareAlike (CC BY-NC-SA).",,Text/pdf,Arabic,Text,KEllis2018-041,,,,,,,,,,,,,,,,,,,,,,,,,,,,,,,,,,,,,,,,,,,,,,,,,,,,,,,,,,,,,,,,,,,,,,,,,,,,,,"1920s,Angele Ellis,Badia Assaf,Ellis,Farida Habib",https://lebanesestudies.omeka.chass.ncsu.edu/files/original/199de8bcefc8cff145642c4f6eb81c50.pdf,,"Angele Hobeiche Kmeid-Ellis Collection: Correspondence",1,1
69782,https://lebanesestudies.omeka.chass.ncsu.edu/items/show/69782,,,,,,,,,,,,,,,,,,,,,,,,,,,,,,,,,,,,,,,,,"Photograph of Badia Assaf sent to Angele Ellis, c. 1920s","Photographs^^ Photos","A photograph of Badia Assaf sent to Angele Ellis circa 1920s.",,"Kail Ellis","Moise A. Khayrallah Center for Lebanese Diaspora Studies","1920s c.",,"Donor retains full ownership of any and all copyright currently controlled in agreement with Khayrallah Center. Nonexclusive right to authorize all uses of these materials for non-commercial research, scholarly, or other educational purposes are granted to Khayrallah Center pursuant to Creative Commons Attribution-NonCommercial-ShareAlike (CC BY-NC-SA).",,Image/pdf,Arabic,Image,KEllis2018-349,,,,,,,,,,,,,,,,,,,,,,,,,,,,,,,,,,,,,,,,,,,,,,,,,,,,,,,,,,,,,,,,,,,,,,,,,,,,,,"1920s,Angele Ellis,Assaf,Badia Assaf,Ellis",https://lebanesestudies.omeka.chass.ncsu.edu/files/original/2c48c0737a886fe8c08138ac2d5af37c.pdf,,"Angele Hobeiche Kmeid-Ellis Collection: Photographs",1,1
68439,https://lebanesestudies.omeka.chass.ncsu.edu/items/show/68439,,,,,,,,,,,,,,,,,,,,,,,,,,,,,,,,,,,,,,,,,"Postcard from Badia Assaf to Angele Ellis, 1986 October 8","Postcard, Arabic^^ Correspondence","A postcard from Badia Assaf to Angele Ellis, dated 8 October 1986. Sent from the Lady of Lebanon in Harissa, Lebanon.","Badia Assaf","Kail Ellis","Moise A. Khayrallah Center for Lebanese Diaspora Studies",1986-10-08,,"Donor retains full ownership of any and all copyright currently controlled in agreement with Khayrallah Center. Nonexclusive right to authorize all uses of these materials for non-commercial research, scholarly, or other educational purposes are granted to Khayrallah Center pursuant to Creative Commons Attribution-NonCommercial-ShareAlike (CC BY-NC-SA).",,Text/pdf,Arabic,Text,KEllis2018-312,,,,,,,,,,,,,,,,,,,,,,,,,,,,,,,,,,,,,,,,,,,,,,,,,,,,,,,,,,,,,,,,,,,,,,,,,,,,,,"1980s,Angele Ellis,Assaf,Badia Assaf,Beirut, Lebanon,Ellis,Harissa, Lebanon,Our Lady of Lebanon, Harissa, Lebanon,Postcards",https://lebanesestudies.omeka.chass.ncsu.edu/files/original/3cd9d9e9d2f227c042d670e24663cbe1.pdf,,"Angele Hobeiche Kmeid-Ellis Collection: Correspondence",1,1
