﻿"Item Id","Item URI","Dublin Core:Alternative Title","Dublin Core:Abstract","Dublin Core:Table Of Contents","Dublin Core:Date Available","Dublin Core:Date Created","Dublin Core:Date Accepted","Dublin Core:Date Copyrighted","Dublin Core:Date Submitted","Dublin Core:Date Issued","Dublin Core:Date Modified","Dublin Core:Date Valid","Dublin Core:Access Rights","Dublin Core:License","Dublin Core:Conforms To","Dublin Core:Has Format","Dublin Core:Has Part","Dublin Core:Has Version","Dublin Core:Is Format Of","Dublin Core:Is Part Of","Dublin Core:Is Referenced By","Dublin Core:Is Replaced By","Dublin Core:Is Required By","Dublin Core:Is Version Of","Dublin Core:References","Dublin Core:Replaces","Dublin Core:Requires","Dublin Core:Extent","Dublin Core:Medium","Dublin Core:Bibliographic Citation","Dublin Core:Spatial Coverage","Dublin Core:Temporal Coverage","Dublin Core:Accrual Method","Dublin Core:Accrual Periodicity","Dublin Core:Accrual Policy","Dublin Core:Audience","Dublin Core:Audience Education Level","Dublin Core:Mediator","Dublin Core:Instructional Method","Dublin Core:Provenance","Dublin Core:Rights Holder","Dublin Core:Title","Dublin Core:Subject","Dublin Core:Description","Dublin Core:Creator","Dublin Core:Source","Dublin Core:Publisher","Dublin Core:Date","Dublin Core:Contributor","Dublin Core:Rights","Dublin Core:Relation","Dublin Core:Format","Dublin Core:Language","Dublin Core:Type","Dublin Core:Identifier","Dublin Core:Coverage","Item Type Metadata:Text","Item Type Metadata:Interviewer","Item Type Metadata:Interviewee","Item Type Metadata:Location","Item Type Metadata:Transcription","Item Type Metadata:Local URL","Item Type Metadata:Original Format","Item Type Metadata:Physical Dimensions","Item Type Metadata:Duration","Item Type Metadata:Compression","Item Type Metadata:Producer","Item Type Metadata:Director","Item Type Metadata:Bit Rate/Frequency","Item Type Metadata:Time Summary","Item Type Metadata:Email Body","Item Type Metadata:Subject Line","Item Type Metadata:From","Item Type Metadata:To","Item Type Metadata:CC","Item Type Metadata:BCC","Item Type Metadata:Number of Attachments","Item Type Metadata:Standards","Item Type Metadata:Objectives","Item Type Metadata:Materials","Item Type Metadata:Lesson Plan Text","Item Type Metadata:URL","Item Type Metadata:Event Type","Item Type Metadata:Participants","Item Type Metadata:Birth Date","Item Type Metadata:Birthplace","Item Type Metadata:Death Date","Item Type Metadata:Occupation","Item Type Metadata:Biographical Text","Item Type Metadata:Bibliography","Item Type Metadata:First Name (English)","Item Type Metadata:Last Name (English)","Item Type Metadata:Address","Item Type Metadata:City","Item Type Metadata:State","Item Type Metadata:Business (English)","Item Type Metadata:Provenance (English)","Item Type Metadata:Provenance (Arabic)","Item Type Metadata:Business (Arabic)","Item Type Metadata:Last Name (Arabic)","Item Type Metadata:First Name (Arabic)","Item Type Metadata:Player","Omeka Legacy File:Additional Creator","Omeka Legacy File:Transcriber","Omeka Legacy File:Producer","Omeka Legacy File:Render Device","Omeka Legacy File:Render Details","Omeka Legacy File:Capture Date","Omeka Legacy File:Capture Device","Omeka Legacy File:Capture Details","Omeka Legacy File:Change History","Omeka Legacy File:Watermark","Omeka Legacy File:Encryption","Omeka Legacy File:Compression","Omeka Legacy File:Post Processing","Omeka Image File:Width","Omeka Image File:Height","Omeka Image File:Bit Depth","Omeka Image File:Channels","Omeka Image File:Exif String","Omeka Image File:Exif Array","Omeka Image File:IPTC String","Omeka Image File:IPTC Array","Omeka Video File:Bitrate","Omeka Video File:Duration","Omeka Video File:Sample Rate","Omeka Video File:Codec","Omeka Video File:Width","Omeka Video File:Height","PDF Text:Text","Users Elements:Test","Test Elements:Test",tags,file,itemType,collection,public,featured
85100,https://lebanesestudies.omeka.chass.ncsu.edu/items/show/85100,,,,,,,,,,,,,,,,,,,,,,,,,,,,,,,,,,,,,,,,,"Letter from Alfred Ellis to Kail Ellis with Holiday Card, 1990 December 17","Letter writing, English^^Holiday Cards^^Correspondence","A letter addressed to Kail Ellis from Alfred Ellis, dated 1990 December 17. The holiday card looks to be from one of Kail's sisters.","Alfred Ellis","Kail Ellis","Moise A. Khayrallah Center for Lebanese Diaspora Studies","1990 December 17",,"The donor retains full ownership of any copyright and rights currently controlled. Nonexclusive right to authorize uses of these materials for non-commercial research, scholarly, or other educational purposes are granted to Khayrallah Center pursuant to U.S. Copyright Law. Usage of the materials for these purposes must be fully credited with the source. The user assumes full responsibility for any use of the materials.",,Text/pdf,English,Text,KEllis2020-210,,,,,,,,,,,,,,,,,,,,,,,,,,,,,,,,,,,,,,,,,,,,,,,,,,,,,,,,,,,,,,,,,,,,,,,,,,,,,,"1990s,Christmas,Envelopes,Letters-English,New York",https://lebanesestudies.omeka.chass.ncsu.edu/files/original/b2263f4f3c6d3f3ffe41144628cf609a.pdf,,"Kmeid-Ellis Collection Series 1: Correspondence and Documents",1,0
85068,https://lebanesestudies.omeka.chass.ncsu.edu/items/show/85068,,,,,,,,,,,,,,,,,,,,,,,,,,,,,,,,,,,,,,,,,"Christmas Card with John Ledwig Gebhard Lund Artwork","Letter writing, Arabic^^Holiday Cards^^Correspondence","Christmas Card with John Ledwig Gebhard Lund Artwork on the front. Arabic section: sender sends receivers season greetings and best wishes.",,"Kail Ellis","Moise A. Khayrallah Center for Lebanese Diaspora Studies",undated,,"The donor retains full ownership of any copyright and rights currently controlled. Nonexclusive right to authorize uses of these materials for non-commercial research, scholarly, or other educational purposes are granted to Khayrallah Center pursuant to U.S. Copyright Law. Usage of the materials for these purposes must be fully credited with the source. The user assumes full responsibility for any use of the materials.",,Text/pdf,Arabic,Text,KEllis2020-242,,,,,,,,,,,,,,,,,,,,,,,,,,,,,,,,,,,,,,,,,,,,,,,,,,,,,,,,,,,,,,,,,,,,,,,,,,,,,,Christmas,https://lebanesestudies.omeka.chass.ncsu.edu/files/original/411c7642cde1f4ce80789e2a55b0fa1d.pdf,,"Kmeid-Ellis Collection Series 1: Correspondence and Documents",1,0
85045,https://lebanesestudies.omeka.chass.ncsu.edu/items/show/85045,,,,,,,,,,,,,,,,,,,,,,,,,,,,,,,,,,,,,,,,,"Christmas Card from Unknown to Kail Ellis, undated","Letter writing, Arabic^^Holiday Cards^^Correspondence","A Christmas card with an unknown sender to Kail Ellis, undated. 'Dear Khalil, Kisses and longing, I am asking from the child Jesus to make these two holidays of christmas and new year to make them many and that you will have health and peace. Reassure me of your well-being and don't forget to write to me. Kisses to you God’s Blessing.'",,"Kail Ellis","Moise A. Khayrallah Center for Lebanese Diaspora Studies",undated,,"The donor retains full ownership of any copyright and rights currently controlled. Nonexclusive right to authorize uses of these materials for non-commercial research, scholarly, or other educational purposes are granted to Khayrallah Center pursuant to U.S. Copyright Law. Usage of the materials for these purposes must be fully credited with the source. The user assumes full responsibility for any use of the materials.",,Text/pdf,Arabic,Text,KEllis2020-265,,,,,,,,,,,,,,,,,,,,,,,,,,,,,,,,,,,,,,,,,,,,,,,,,,,,,,,,,,,,,,,,,,,,,,,,,,,,,,"Christmas,Letters-Arabic",https://lebanesestudies.omeka.chass.ncsu.edu/files/original/3beb6e643e5f776221b7aa4d61d1d114.pdf,,"Kmeid-Ellis Collection Series 1: Correspondence and Documents",1,0
85044,https://lebanesestudies.omeka.chass.ncsu.edu/items/show/85044,,,,,,,,,,,,,,,,,,,,,,,,,,,,,,,,,,,,,,,,,"Holiday Card from Toufic Ellis to Kail Ellis, undated","Letter writing, English^^Letter writing, Arabic^^Holiday Cards^^Correspondence","A holiday card addressed to Kail Ellis from Toufic Ellis, undated. Includes a note from Kail noting that this card was from his father based on handwriting.","Toufic Ellis","Kail Ellis","Moise A. Khayrallah Center for Lebanese Diaspora Studies",undated,,"The donor retains full ownership of any copyright and rights currently controlled. Nonexclusive right to authorize uses of these materials for non-commercial research, scholarly, or other educational purposes are granted to Khayrallah Center pursuant to U.S. Copyright Law. Usage of the materials for these purposes must be fully credited with the source. The user assumes full responsibility for any use of the materials.",,Text/pdf,English^^Arabic,Text,KEllis2020-266,,,,,,,,,,,,,,,,,,,,,,,,,,,,,,,,,,,,,,,,,,,,,,,,,,,,,,,,,,,,,,,,,,,,,,,,,,,,,,"Christmas,Letters-Arabic,Letters-English",https://lebanesestudies.omeka.chass.ncsu.edu/files/original/30aed85afe8f141d56a9e33cadcf089d.pdf,,"Kmeid-Ellis Collection Series 1: Correspondence and Documents",1,0
84900,https://lebanesestudies.omeka.chass.ncsu.edu/items/show/84900,,,,,,,,,,,,,,,,,,,,,,,,,,,,,,,,,,,,,,,,,"Card from Kail",,"Card, likely Christmas greetings from Kail. ","Kail Ellis","Kail Ellis","Moise A. Khayrallah Center for Lebanese Diaspora Studies",undated,,"The donor retains full ownership of any copyright and rights currently controlled. Nonexclusive right to authorize uses of these materials for non-commercial research, scholarly, or other educational purposes are granted to Khayrallah Center pursuant to U.S. Copyright Law. Usage of the materials for these purposes must be fully credited with the source. The user assumes full responsibility for any use of the materials.",,Text/pdf,English,Text,KEllis2020-835,,,,,,,,,,,,,,,,,,,,,,,,,,,,,,,,,,,,,,,,,,,,,,,,,,,,,,,,,,,,,,,,,,,,,,,,,,,,,,"Christmas,Letters-English",https://lebanesestudies.omeka.chass.ncsu.edu/files/original/57419964e3d741b2682442cbcfeefc0f.pdf,,"Kmeid-Ellis Collection Series 1: Correspondence and Documents",1,0
82918,https://lebanesestudies.omeka.chass.ncsu.edu/items/show/82918,,,,,,,,,,,,,,,,,,,,,,,,,,,,,,,,,,,,,,,,,"Leonard Oussani Christmas Card","Lebanese--United States^^ Photographs^^ Families","A Christmas card signed by Leonard J. Oussani, featuring a photo of him.",,"Oussani Fuleihan family","Moise A. Khayrallah Center for Lebanese Diaspora Studies",undated,,"The donor retains full ownership of any copyright and rights currently controlled. Nonexclusive right to authorize uses of these materials for non-commercial research, scholarly, or other educational purposes are granted to Khayrallah Center pursuant to U.S. Copyright Law. Usage of the materials for these purposes must be fully credited with the source. The user assumes full responsibility for any use of the materials.",,Image/pdf,English,Image,Oussani2018-0179,,,,,,,,,,,,,,,,,,,,,,,,,,,,,,,,,,,,,,,,,,,,,,,,,,,,,,,,,,,,,,,,,,,,,,,,,,,,,,Christmas,https://lebanesestudies.omeka.chass.ncsu.edu/files/original/28096567d431ac059353e86f62ca4e98.pdf,,"Oussani and Fuleihan Family Papers Series 2: Photographs",1,0
82848,https://lebanesestudies.omeka.chass.ncsu.edu/items/show/82848,,,,,,,,,,,,,,,,,,,,,,,,,,,,,,,,,,,,,,,,,"Thomas Oussani Reading in a Chair","Lebanese--United States^^ Photographs^^ Families","A photograph of Tommy Oussani reading in a chair with Christmas decorations around.",,"Oussani Fuleihan family","Moise A. Khayrallah Center for Lebanese Diaspora Studies",1962,,"The donor retains full ownership of any copyright and rights currently controlled. Nonexclusive right to authorize uses of these materials for non-commercial research, scholarly, or other educational purposes are granted to Khayrallah Center pursuant to U.S. Copyright Law. Usage of the materials for these purposes must be fully credited with the source. The user assumes full responsibility for any use of the materials.",,Image/pdf,English,Image,Oussani2018-0249,,,,,,,,,,,,,,,,,,,,,,,,,,,,,,,,,,,,,,,,,,,,,,,,,,,,,,,,,,,,,,,,,,,,,,,,,,,,,,"1960s,Christmas",https://lebanesestudies.omeka.chass.ncsu.edu/files/original/e8c0d5df322d36ecd956e0dfd5e6c1cd.pdf,,"Oussani and Fuleihan Family Papers Series 2: Photographs",1,0
82348,https://lebanesestudies.omeka.chass.ncsu.edu/items/show/82348,,,,,,,,,,,,,,,,,,,,,,,,,,,,,,,,,,,,,,,,,"Christmas Card with Four Children, 1947","Lebanese--United States^^ Photographs^^ Families","A Christmas card featuring four children, listed as Amin, Ferad, Lanie, and Nadir, with a note from them to their grandfather, Daoud or David. ","Albert Beyrouth","Oussani Fuleihan family","Moise A. Khayrallah Center for Lebanese Diaspora Studies","1947 Dec 9",,"The donor retains full ownership of any copyright and rights currently controlled. Nonexclusive right to authorize uses of these materials for non-commercial research, scholarly, or other educational purposes are granted to Khayrallah Center pursuant to U.S. Copyright Law. Usage of the materials for these purposes must be fully credited with the source. The user assumes full responsibility for any use of the materials.",,Image/pdf,,Image,Oussani2018-0873,,,,,,,,,,,,,,,,,,,,,,,,,,,,,,,,,,,,,,,,,,,,,,,,,,,,,,,,,,,,,,,,,,,,,,,,,,,,,,"1940s,Christmas,Families",https://lebanesestudies.omeka.chass.ncsu.edu/files/original/3dbd6426798de16e4d9318be5bb579bc.pdf,,"Oussani and Fuleihan Family Papers Series 2: Photographs",1,0
82285,https://lebanesestudies.omeka.chass.ncsu.edu/items/show/82285,,,,,,,,,,,,,,,,,,,,,,,,,,,,,,,,,,,,,,,,,"Christmas Card with Pictures of Rosemarie Fuleihan","Lebanese--United States^^ Photographs^^ Families","A Christmas card from Rosemarie and Michael Fuleihan, who were married in 1959. Includes two photos of Rosemarie.",,"Oussani Fuleihan family","Moise A. Khayrallah Center for Lebanese Diaspora Studies",1959,,"The donor retains full ownership of any copyright and rights currently controlled. Nonexclusive right to authorize uses of these materials for non-commercial research, scholarly, or other educational purposes are granted to Khayrallah Center pursuant to U.S. Copyright Law. Usage of the materials for these purposes must be fully credited with the source. The user assumes full responsibility for any use of the materials.",,Image/pdf,English,Image,Oussani2018-0937,,,,,,,,,,,,,,,,,,,,,,,,,,,,,,,,,,,,,,,,,,,,,,,,,,,,,,,,,,,,,,,,,,,,,,,,,,,,,,"1950s,Christmas",https://lebanesestudies.omeka.chass.ncsu.edu/files/original/0763dedb7b2fdb4aa6e544fb71fe65e7.pdf,,"Oussani and Fuleihan Family Papers Series 2: Photographs",1,0
82094,https://lebanesestudies.omeka.chass.ncsu.edu/items/show/82094,,,,,,,,,,,,,,,,,,,,,,,,,,,,,,,,,,,,,,,,,"Christmas Card, 1936",Correspondence,"A Christmas card sent to Mrs. Oussani, postmarked 1936, still in original envelope. The card features a drawing of the pyramids in Egypt and says ""Wishing You a Happy Christmas and a Bright New Year.""",,"Oussani Fuleihan family","Moise A. Khayrallah Center for Lebanese Diaspora Studies","1936 December 15",,"The donor retains full ownership of any copyright and rights currently controlled. Nonexclusive right to authorize uses of these materials for non-commercial research, scholarly, or other educational purposes are granted to Khayrallah Center pursuant to U.S. Copyright Law. Usage of the materials for these purposes must be fully credited with the source. The user assumes full responsibility for any use of the materials.",,Text/pdf,English,Text,Oussani2018-0365,,,,,,,,,,,,,,,,,,,,,,,,,,,,,,,,,,,,,,,,,,,,,,,,,,,,,,,,,,,,,,,,,,,,,,,,,,,,,,"1930s,Christmas,Egypt",https://lebanesestudies.omeka.chass.ncsu.edu/files/original/afd64c67b500bd4375f5b9239b409ec2.pdf,,"Oussani and Fuleihan Family Papers Series 1: Documents",1,0
81830,https://lebanesestudies.omeka.chass.ncsu.edu/items/show/81830,,,,,,,,,,,,,,,,,,,,,,,,,,,,,,,,,,,,,,,,,"Holiday Greeting Card from the Dodge Family","Photographs^^ Lebanon","A holiday greeting card from the Dodge family, probably the family of Bayard Dodge, who was the president of the American University of Beirut at the time. ",,"Phyllis Creighton Danby","Moise A. Khayrallah Center for Lebanese Diaspora Studies",1929,,"The donor retains full ownership of any copyright and rights currently controlled. Nonexclusive right to authorize uses of these materials for non-commercial research, scholarly, or other educational purposes are granted to Khayrallah Center pursuant to U.S. Copyright Law. Usage of the materials for these purposes must be fully credited with the source. The user assumes full responsibility for any use of the materials.",,Image/jpg,,Image,kc0021_017,,,,,,,,,,,,,,,,,,,,,,,,,,,,,,,,,,,,,,,,,,,,,,,,,,,,,,,,,,,,,,,,,,,,,,,,,,,,,,"1920s,Christmas,Families",https://lebanesestudies.omeka.chass.ncsu.edu/files/original/46e16f565cdd0ae363412795f0df6e69.jpg,,"Creighton Family Papers",1,0
81829,https://lebanesestudies.omeka.chass.ncsu.edu/items/show/81829,,,,,,,,,,,,,,,,,,,,,,,,,,,,,,,,,,,,,,,,,"Holiday Greeting Card from the Leavitt Family","Photographs^^ Lebanon","A holiday greeting card from the Leavitt family who was associated with the American University of Beirut. ",,"Phyllis Creighton Danby","Moise A. Khayrallah Center for Lebanese Diaspora Studies","circa 1928",,"The donor retains full ownership of any copyright and rights currently controlled. Nonexclusive right to authorize uses of these materials for non-commercial research, scholarly, or other educational purposes are granted to Khayrallah Center pursuant to U.S. Copyright Law. Usage of the materials for these purposes must be fully credited with the source. The user assumes full responsibility for any use of the materials.",,Image/jpg,,Image,kc0021_016,,,,,,,,,,,,,,,,,,,,,,,,,,,,,,,,,,,,,,,,,,,,,,,,,,,,,,,,,,,,,,,,,,,,,,,,,,,,,,"1920s,Christmas,Families",https://lebanesestudies.omeka.chass.ncsu.edu/files/original/492db2c43d0407b0b012c3b4fd005ddf.jpg,,"Creighton Family Papers",1,0
81827,https://lebanesestudies.omeka.chass.ncsu.edu/items/show/81827,,,,,,,,,,,,,,,,,,,,,,,,,,,,,,,,,,,,,,,,,"Holiday Greeting Card","Photographs^^ Lebanon","A holiday greeting card from an unidentified family. ",,"Phyllis Creighton Danby","Moise A. Khayrallah Center for Lebanese Diaspora Studies",1927,,"The donor retains full ownership of any copyright and rights currently controlled. Nonexclusive right to authorize uses of these materials for non-commercial research, scholarly, or other educational purposes are granted to Khayrallah Center pursuant to U.S. Copyright Law. Usage of the materials for these purposes must be fully credited with the source. The user assumes full responsibility for any use of the materials.",,Image/jpg,,Image,kc0021_014,,,,,,,,,,,,,,,,,,,,,,,,,,,,,,,,,,,,,,,,,,,,,,,,,,,,,,,,,,,,,,,,,,,,,,,,,,,,,,"1920s,Christmas,Families",https://lebanesestudies.omeka.chass.ncsu.edu/files/original/799f09b58db957fa18efc6a2e2c4c89d.jpg,,"Creighton Family Papers",1,0
81779,https://lebanesestudies.omeka.chass.ncsu.edu/items/show/81779,,,,,,,,,,,,,,,,,,,,,,,,,,,,,,,,,,,,,,,,,"Signed Holiday Card From Barbara Estes' ESL class to Barbara Estes","Lebanese--United States","A signed holiday card from Barbara Estes's ESL class to Barbara Estes. This class was held at the Highlands Falls Country Club in Highlands, North Carolina. Caption on the back reads, ""Barbara's ESL class of HFCC 2001-02.""",,"Barbara Kahdy Estes","Moise A. Khayrallah Center for Lebanese Diaspora Studies",2001-2002,,"The donor retains full ownership of any copyright and rights currently controlled. Nonexclusive right to authorize uses of these materials for non-commercial research, scholarly, or other educational purposes are granted to Khayrallah Center pursuant to U.S. Copyright Law. Usage of the materials for these purposes must be fully credited with the source. The user assumes full responsibility for any use of the materials.",,Image/pdf,,Text,Kahdy2019_221,,,,,,,,,,,,,,,,,,,,,,,,,,,,,,,,,,,,,,,,,,,,,,,,,,,,,,,,,,,,,,,,,,,,,,,,,,,,,,"2000s,Christmas,Education",https://lebanesestudies.omeka.chass.ncsu.edu/files/original/e1837c6def217c7e8cfefa04a15e7b6d.pdf,,"Kahdy and Wehbie Family Papers",1,0
81756,https://lebanesestudies.omeka.chass.ncsu.edu/items/show/81756,,,,,,,,,,,,,,,,,,,,,,,,,,,,,,,,,,,,,,,,,"Nell and George Kahdy Holding Hands Under by a Christmas Tree","Lebanese--United States^^ Photographs","George Kahdy has his arm around his wife Nell and holds her hand. Behind them stands a Christmas tree decorated with a variety of ornaments and tinsel.",,"Barbara Kahdy Estes","Moise A. Khayrallah Center for Lebanese Diaspora Studies",1970,,"The donor retains full ownership of any copyright and rights currently controlled. Nonexclusive right to authorize uses of these materials for non-commercial research, scholarly, or other educational purposes are granted to Khayrallah Center pursuant to U.S. Copyright Law. Usage of the materials for these purposes must be fully credited with the source. The user assumes full responsibility for any use of the materials.",,Image/pdf,,Image,Kahdy2019_198,,,,,,,,,,,,,,,,,,,,,,,,,,,,,,,,,,,,,,,,,,,,,,,,,,,,,,,,,,,,,,,,,,,,,,,,,,,,,,"1970s,Christmas",https://lebanesestudies.omeka.chass.ncsu.edu/files/original/4cc81c0f612f0e8fce53f53ad33faacb.pdf,,"Kahdy and Wehbie Family Papers",1,0
81722,https://lebanesestudies.omeka.chass.ncsu.edu/items/show/81722,,,,,,,,,,,,,,,,,,,,,,,,,,,,,,,,,,,,,,,,,"Georgette, Barbara, and George Jr. Kahdy Standing in the Snow","Lebanese--United States^^ Photographs","Georgette, Barbara, and George Jr. Kahdy stand side by side in the snow. They are all dressed in winter jackets, rain boots, gloves, and hats. Caption on the back reads, ""Georgette, Barbara, George 50s.""",,"Barbara Kahdy Estes","Moise A. Khayrallah Center for Lebanese Diaspora Studies",1950s,,"The donor retains full ownership of any copyright and rights currently controlled. Nonexclusive right to authorize uses of these materials for non-commercial research, scholarly, or other educational purposes are granted to Khayrallah Center pursuant to U.S. Copyright Law. Usage of the materials for these purposes must be fully credited with the source. The user assumes full responsibility for any use of the materials.",,Image/pdf,,Image,Kahdy2019_164,,,,,,,,,,,,,,,,,,,,,,,,,,,,,,,,,,,,,,,,,,,,,,,,,,,,,,,,,,,,,,,,,,,,,,,,,,,,,,"1950s,Christmas,Families",https://lebanesestudies.omeka.chass.ncsu.edu/files/original/c518cb992696d1bd7178bbd9896c8dda.pdf,,"Kahdy and Wehbie Family Papers",1,0
81721,https://lebanesestudies.omeka.chass.ncsu.edu/items/show/81721,,,,,,,,,,,,,,,,,,,,,,,,,,,,,,,,,,,,,,,,,"Young George Jr., Georgette, and Barbara Kahdy During Christmas","Lebanese--United States^^ Photographs","Young George Jr., Georgette, and Barbara Kahdy sit under a Christmas tree and unwrap presents.",,"Barbara Kahdy Estes","Moise A. Khayrallah Center for Lebanese Diaspora Studies",1950s,,"The donor retains full ownership of any copyright and rights currently controlled. Nonexclusive right to authorize uses of these materials for non-commercial research, scholarly, or other educational purposes are granted to Khayrallah Center pursuant to U.S. Copyright Law. Usage of the materials for these purposes must be fully credited with the source. The user assumes full responsibility for any use of the materials.",,Image/pdf,,Image,Kahdy2019_163,,,,,,,,,,,,,,,,,,,,,,,,,,,,,,,,,,,,,,,,,,,,,,,,,,,,,,,,,,,,,,,,,,,,,,,,,,,,,,"1950s,Barbara Kahdy Estes,Christmas,George Kahdy Jr.,Georgette Kahdy Stone",https://lebanesestudies.omeka.chass.ncsu.edu/files/original/e591f8ffef38fc273cb64472fa046cfb.pdf,,"Kahdy and Wehbie Family Papers",1,0