﻿"Item Id","Item URI","Dublin Core:Alternative Title","Dublin Core:Abstract","Dublin Core:Table Of Contents","Dublin Core:Date Available","Dublin Core:Date Created","Dublin Core:Date Accepted","Dublin Core:Date Copyrighted","Dublin Core:Date Submitted","Dublin Core:Date Issued","Dublin Core:Date Modified","Dublin Core:Date Valid","Dublin Core:Access Rights","Dublin Core:License","Dublin Core:Conforms To","Dublin Core:Has Format","Dublin Core:Has Part","Dublin Core:Has Version","Dublin Core:Is Format Of","Dublin Core:Is Part Of","Dublin Core:Is Referenced By","Dublin Core:Is Replaced By","Dublin Core:Is Required By","Dublin Core:Is Version Of","Dublin Core:References","Dublin Core:Replaces","Dublin Core:Requires","Dublin Core:Extent","Dublin Core:Medium","Dublin Core:Bibliographic Citation","Dublin Core:Spatial Coverage","Dublin Core:Temporal Coverage","Dublin Core:Accrual Method","Dublin Core:Accrual Periodicity","Dublin Core:Accrual Policy","Dublin Core:Audience","Dublin Core:Audience Education Level","Dublin Core:Mediator","Dublin Core:Instructional Method","Dublin Core:Provenance","Dublin Core:Rights Holder","Dublin Core:Title","Dublin Core:Subject","Dublin Core:Description","Dublin Core:Creator","Dublin Core:Source","Dublin Core:Publisher","Dublin Core:Date","Dublin Core:Contributor","Dublin Core:Rights","Dublin Core:Relation","Dublin Core:Format","Dublin Core:Language","Dublin Core:Type","Dublin Core:Identifier","Dublin Core:Coverage","Item Type Metadata:Text","Item Type Metadata:Interviewer","Item Type Metadata:Interviewee","Item Type Metadata:Location","Item Type Metadata:Transcription","Item Type Metadata:Local URL","Item Type Metadata:Original Format","Item Type Metadata:Physical Dimensions","Item Type Metadata:Duration","Item Type Metadata:Compression","Item Type Metadata:Producer","Item Type Metadata:Director","Item Type Metadata:Bit Rate/Frequency","Item Type Metadata:Time Summary","Item Type Metadata:Email Body","Item Type Metadata:Subject Line","Item Type Metadata:From","Item Type Metadata:To","Item Type Metadata:CC","Item Type Metadata:BCC","Item Type Metadata:Number of Attachments","Item Type Metadata:Standards","Item Type Metadata:Objectives","Item Type Metadata:Materials","Item Type Metadata:Lesson Plan Text","Item Type Metadata:URL","Item Type Metadata:Event Type","Item Type Metadata:Participants","Item Type Metadata:Birth Date","Item Type Metadata:Birthplace","Item Type Metadata:Death Date","Item Type Metadata:Occupation","Item Type Metadata:Biographical Text","Item Type Metadata:Bibliography","Item Type Metadata:First Name (English)","Item Type Metadata:Last Name (English)","Item Type Metadata:Address","Item Type Metadata:City","Item Type Metadata:State","Item Type Metadata:Business (English)","Item Type Metadata:Provenance (English)","Item Type Metadata:Provenance (Arabic)","Item Type Metadata:Business (Arabic)","Item Type Metadata:Last Name (Arabic)","Item Type Metadata:First Name (Arabic)","Item Type Metadata:Player","Omeka Legacy File:Additional Creator","Omeka Legacy File:Transcriber","Omeka Legacy File:Producer","Omeka Legacy File:Render Device","Omeka Legacy File:Render Details","Omeka Legacy File:Capture Date","Omeka Legacy File:Capture Device","Omeka Legacy File:Capture Details","Omeka Legacy File:Change History","Omeka Legacy File:Watermark","Omeka Legacy File:Encryption","Omeka Legacy File:Compression","Omeka Legacy File:Post Processing","Omeka Image File:Width","Omeka Image File:Height","Omeka Image File:Bit Depth","Omeka Image File:Channels","Omeka Image File:Exif String","Omeka Image File:Exif Array","Omeka Image File:IPTC String","Omeka Image File:IPTC Array","Omeka Video File:Bitrate","Omeka Video File:Duration","Omeka Video File:Sample Rate","Omeka Video File:Codec","Omeka Video File:Width","Omeka Video File:Height","PDF Text:Text","Users Elements:Test","Test Elements:Test",tags,file,itemType,collection,public,featured
79266,https://lebanesestudies.omeka.chass.ncsu.edu/items/show/79266,,,,,,,,,,,,,,,,,,,,,,,,,,,,,,,,,,,,,,,,,"Adults with Baby at Christmas",Photographs^^Christmas,"Vera Khayrallah and her sister posing with the Khayrallah's nephew, Alex, with a Christmas tree in the background.","Moise Khayrallah","Moise and Vera Khayrallah","Moise A. Khayrallah Center for Lebanese Diaspora Studies",1988,,"The donor retains full ownership of any copyright and rights currently controlled. Nonexclusive right to authorize uses of these materials for non-commercial research, scholarly, or other educational purposes are granted to Khayrallah Center pursuant to U.S. Copyright Law. Usage of the materials for these purposes must be fully credited with the source. The user assumes full responsibility for any use of the materials.",,Image/pdf,,Image,kc0036_019,,,,,,,,,,,,,,,,,,,,,,,,,,,,,,,,,,,,,,,,,,,,,,,,,,,,,,,,,,,,,,,,,,,,,,,,,,,,,,"1980s,Christmas,Families",https://lebanesestudies.omeka.chass.ncsu.edu/files/original/4ca2da2fc226e0e06ee305607b976417.pdf,,"Moise and Vera Khayrallah Papers",1,0
81518,https://lebanesestudies.omeka.chass.ncsu.edu/items/show/81518,,,,,,,,,,,,,,,,,,,,,,,,,,,,,,,,,,,,,,,,,"Baddour Christmas Photograph 1","Lebanese--United States^^ ","A group photograph of the Baddour family during Christmas.",,"Philip Augustine Baddour and Richard Allen Baddour","Moise A. Khayrallah Center for Lebanese Diaspora Studies",2007,,"The donor retains full ownership of any copyright and rights currently controlled. Nonexclusive right to authorize uses of these materials for non-commercial research, scholarly, or other educational purposes are granted to Khayrallah Center pursuant to U.S. Copyright Law. Usage of the materials for these purposes must be fully credited with the source. The user assumes full responsibility for any use of the materials.",,Image/pdf,,Image,kc0019_001,,,,,,,,,,,,,,,,,,,,,,,,,,,,,,,,,,,,,,,,,,,,,,,,,,,,,,,,,,,,,,,,,,,,,,,,,,,,,,"2000s,Christmas",https://lebanesestudies.omeka.chass.ncsu.edu/files/original/36be7bd8184dd6c692b37fd3cac0f33e.pdf,,"Baddour Family Papers",1,0
81517,https://lebanesestudies.omeka.chass.ncsu.edu/items/show/81517,,,,,,,,,,,,,,,,,,,,,,,,,,,,,,,,,,,,,,,,,"Baddour Christmas Photograph 2","Lebanese--United States^^ ","A group photograph of the Baddour family during Christmas.",,"Philip Augustine Baddour and Richard Allen Baddour","Moise A. Khayrallah Center for Lebanese Diaspora Studies",2007,,"The donor retains full ownership of any copyright and rights currently controlled. Nonexclusive right to authorize uses of these materials for non-commercial research, scholarly, or other educational purposes are granted to Khayrallah Center pursuant to U.S. Copyright Law. Usage of the materials for these purposes must be fully credited with the source. The user assumes full responsibility for any use of the materials.",,Image/pdf,,Image,kc0019_002,,,,,,,,,,,,,,,,,,,,,,,,,,,,,,,,,,,,,,,,,,,,,,,,,,,,,,,,,,,,,,,,,,,,,,,,,,,,,,"2000s,Christmas",https://lebanesestudies.omeka.chass.ncsu.edu/files/original/79d5ad91027bd97388ea634a31b3a5af.pdf,,"Baddour Family Papers",1,0
85263,https://lebanesestudies.omeka.chass.ncsu.edu/items/show/85263,,,,,,,,,,,,,,,,,,,,,,,,,,,,,,,,,,,,,,,,,"Card and Envelope from Kail Ellis to Angele Ellis and Toufic Ellis","Letter writing, English^^ Correspondence","A card and envelope from Kail Ellis to Angele and Toufic Ellis, dated 13 December 1963. This is a Christmas and New Year's card with an image of an angel on the front.","Kail Ellis","Kail Ellis","Moise A. Khayrallah Center for Lebanese Diaspora Studies","1963 December 13",,"The donor retains full ownership of any copyright and rights currently controlled. Nonexclusive right to authorize uses of these materials for non-commercial research, scholarly, or other educational purposes are granted to Khayrallah Center pursuant to U.S. Copyright Law. Usage of the materials for these purposes must be fully credited with the source. The user assumes full responsibility for any use of the materials.",,Text/pdf,English,Text,KEllis2020-047,,,,,,,,,,,,,,,,,,,,,,,,,,,,,,,,,,,,,,,,,,,,,,,,,,,,,,,,,,,,,,,,,,,,,,,,,,,,,,"1960s,Christmas,Envelopes,Letters-English",https://lebanesestudies.omeka.chass.ncsu.edu/files/original/524dc0e0292fb1e3a46c684513a7abfc.pdf,,"Kmeid-Ellis Collection Series 1: Correspondence and Documents",1,0
85473,https://lebanesestudies.omeka.chass.ncsu.edu/items/show/85473,,,,,,,,,,,,,,,,,,,,,,,,,,,,,,,,,,,,,,,,,"Card from Badia Assaf to Angele Ellis, c. 1951","Correspondence^^Christmas Cards^^Christmas","An undated card from Badia Assaf to Angele Ellis circa 1951.","Badia Assaf","Kail Ellis","Moise A. Khayrallah Center for Lebanese Diaspora Studies","circa 1951 ",,"The donor retains full ownership of any copyright and rights currently controlled. Nonexclusive right to authorize uses of these materials for non-commercial research, scholarly, or other educational purposes are granted to Khayrallah Center pursuant to U.S. Copyright Law. Usage of the materials for these purposes must be fully credited with the source. The user assumes full responsibility for any use of the materials.",,Text/pdf,Arabic,Text,KEllis2018-334,,,,,,,,,,,,,,,,,,,,,,,,,,,,,,,,,,,,,,,,,,,,,,,,,,,,,,,,,,,,,,,,,,,,,,,,,,,,,,"1950s,Christmas,Letters-Arabic",https://lebanesestudies.omeka.chass.ncsu.edu/files/original/14268d4d8187a74eaed633d96802a628.pdf,,"Kmeid-Ellis Collection Series 1: Correspondence and Documents",1,0
84900,https://lebanesestudies.omeka.chass.ncsu.edu/items/show/84900,,,,,,,,,,,,,,,,,,,,,,,,,,,,,,,,,,,,,,,,,"Card from Kail",,"Card, likely Christmas greetings from Kail. ","Kail Ellis","Kail Ellis","Moise A. Khayrallah Center for Lebanese Diaspora Studies",undated,,"The donor retains full ownership of any copyright and rights currently controlled. Nonexclusive right to authorize uses of these materials for non-commercial research, scholarly, or other educational purposes are granted to Khayrallah Center pursuant to U.S. Copyright Law. Usage of the materials for these purposes must be fully credited with the source. The user assumes full responsibility for any use of the materials.",,Text/pdf,English,Text,KEllis2020-835,,,,,,,,,,,,,,,,,,,,,,,,,,,,,,,,,,,,,,,,,,,,,,,,,,,,,,,,,,,,,,,,,,,,,,,,,,,,,,"Christmas,Letters-English",https://lebanesestudies.omeka.chass.ncsu.edu/files/original/57419964e3d741b2682442cbcfeefc0f.pdf,,"Kmeid-Ellis Collection Series 1: Correspondence and Documents",1,0
85293,https://lebanesestudies.omeka.chass.ncsu.edu/items/show/85293,,,,,,,,,,,,,,,,,,,,,,,,,,,,,,,,,,,,,,,,,"Christmas Card from Chukralla Mubarak to Ellis Family, 1960 December 16","Letter writing, English^^ Letter writing, Arabic^^ Correspondence","A Christmas Card from Chukralla Mubarak to the Ellis family wishing them a Merry Christmas, dated 16 December 1960. Postmarked from Hallandale, Florida with images of Christ and Mary.","Chukralla Mubarak ","Kail Ellis","Moise A. Khayrallah Center for Lebanese Diaspora Studies","1960 December 16",,"The donor retains full ownership of any copyright and rights currently controlled. Nonexclusive right to authorize uses of these materials for non-commercial research, scholarly, or other educational purposes are granted to Khayrallah Center pursuant to U.S. Copyright Law. Usage of the materials for these purposes must be fully credited with the source. The user assumes full responsibility for any use of the materials.",,Text/pdf,English^^Arabic,Text,KEllis2020-017,,,,,,,,,,,,,,,,,,,,,,,,,,,,,,,,,,,,,,,,,,,,,,,,,,,,,,,,,,,,,,,,,,,,,,,,,,,,,,"1960s,Christmas,Florida",https://lebanesestudies.omeka.chass.ncsu.edu/files/original/ff485b960794413e4dd9507a557bb6f9.pdf,,"Kmeid-Ellis Collection Series 1: Correspondence and Documents",1,0
85291,https://lebanesestudies.omeka.chass.ncsu.edu/items/show/85291,,,,,,,,,,,,,,,,,,,,,,,,,,,,,,,,,,,,,,,,,"Christmas Card from Dave to Kail Ellis, 1960 December 20","Letter writing, English^^ Correspondence","A Christmas Card from Dave (no surname) to Kail Ellis, dated 20 December 1960.",Dave,"Kail Ellis","Moise A. Khayrallah Center for Lebanese Diaspora Studies","1960 December 20",,"The donor retains full ownership of any copyright and rights currently controlled. Nonexclusive right to authorize uses of these materials for non-commercial research, scholarly, or other educational purposes are granted to Khayrallah Center pursuant to U.S. Copyright Law. Usage of the materials for these purposes must be fully credited with the source. The user assumes full responsibility for any use of the materials.",,Text/pdf,English,Text,KEllis2020-019,,,,,,,,,,,,,,,,,,,,,,,,,,,,,,,,,,,,,,,,,,,,,,,,,,,,,,,,,,,,,,,,,,,,,,,,,,,,,,"1960s,Christmas",https://lebanesestudies.omeka.chass.ncsu.edu/files/original/c70c778dd1c94049213fd083f7ef4e35.pdf,,"Kmeid-Ellis Collection Series 1: Correspondence and Documents",1,0
85329,https://lebanesestudies.omeka.chass.ncsu.edu/items/show/85329,,,,,,,,,,,,,,,,,,,,,,,,,,,,,,,,,,,,,,,,,"Christmas Card from Delor Ellis to Marie Theresa Ellis, 2014 December","Christmas cards^^Greeting cards","A Christmas card from Delor Ellis to Theresa Ellis, dated December 2014.","Delor Ellis","Kail Ellis","Moise A. Khayrallah Center for Lebanese Diaspora Studies","2014 December ",,"The donor retains full ownership of any copyright and rights currently controlled. Nonexclusive right to authorize uses of these materials for non-commercial research, scholarly, or other educational purposes are granted to Khayrallah Center pursuant to U.S. Copyright Law. Usage of the materials for these purposes must be fully credited with the source. The user assumes full responsibility for any use of the materials.",,Text/pdf,,Text,KEllis2019-165,,,,,,,,,,,,,,,,,,,,,,,,,,,,,,,,,,,,,,,,,,,,,,,,,,,,,,,,,,,,,,,,,,,,,,,,,,,,,,"2010s,Christmas",https://lebanesestudies.omeka.chass.ncsu.edu/files/original/426aeddb32f2d0a3cd1ae25d0c76be1d.pdf,,"Kmeid-Ellis Collection Series 1: Correspondence and Documents",1,0
85370,https://lebanesestudies.omeka.chass.ncsu.edu/items/show/85370,,,,,,,,,,,,,,,,,,,,,,,,,,,,,,,,,,,,,,,,,"Christmas Card from George to Kail Ellis, 1959 December 29","Letter writing, Arabic^^Correspondence^^Christmas Cards","A Christmas card from George (last name unknown) to Kail Ellis, dated 29 December 1959. Sent from Baabda, Lebanon with a photograph Jupiter Temple's Pillars of Baalbek, Lebanon.",,"Kail Ellis","Moise A. Khayrallah Center for Lebanese Diaspora Studies","1959 December 29",,"The donor retains full ownership of any copyright and rights currently controlled. Nonexclusive right to authorize uses of these materials for non-commercial research, scholarly, or other educational purposes are granted to Khayrallah Center pursuant to U.S. Copyright Law. Usage of the materials for these purposes must be fully credited with the source. The user assumes full responsibility for any use of the materials.",,Text/pdf,Arabic,Text,KEllis2019-053,,,,,,,,,,,,,,,,,,,,,,,,,,,,,,,,,,,,,,,,,,,,,,,,,,,,,,,,,,,,,,,,,,,,,,,,,,,,,,"1950s,Christmas,Lebanon,Letters-Arabic",https://lebanesestudies.omeka.chass.ncsu.edu/files/original/bc2ea0737edbf52b3494f85d10f51f00.pdf,,"Kmeid-Ellis Collection Series 1: Correspondence and Documents",1,0
85567,https://lebanesestudies.omeka.chass.ncsu.edu/items/show/85567,,,,,,,,,,,,,,,,,,,,,,,,,,,,,,,,,,,,,,,,,"Christmas Card from George Tumeh to Kail Ellis, 1959 December 20","Christmas cards^^Greeting cards","A Christmas card from George Tumeh to Kail Ellis titled, 'Lebanon -- The Cedars' with an image of a cedar tree covered in snow, dated 20 December 1959.","George Tumeh","Kail Ellis","Moise A. Khayrallah Center for Lebanese Diaspora Studies","1959 December 20",,"The donor retains full ownership of any copyright and rights currently controlled. Nonexclusive right to authorize uses of these materials for non-commercial research, scholarly, or other educational purposes are granted to Khayrallah Center pursuant to U.S. Copyright Law. Usage of the materials for these purposes must be fully credited with the source. The user assumes full responsibility for any use of the materials.",,Text/pdf,Arabic^^English,Text,KEllis2018-239,,,,,,,,,,,,,,,,,,,,,,,,,,,,,,,,,,,,,,,,,,,,,,,,,,,,,,,,,,,,,,,,,,,,,,,,,,,,,,"1950s,Christmas,Letters-Arabic,Letters-English",https://lebanesestudies.omeka.chass.ncsu.edu/files/original/137f61d718c90106b3ead42664517fc4.pdf,,"Kmeid-Ellis Collection Series 1: Correspondence and Documents",1,0
85045,https://lebanesestudies.omeka.chass.ncsu.edu/items/show/85045,,,,,,,,,,,,,,,,,,,,,,,,,,,,,,,,,,,,,,,,,"Christmas Card from Unknown to Kail Ellis, undated","Letter writing, Arabic^^Holiday Cards^^Correspondence","A Christmas card with an unknown sender to Kail Ellis, undated. 'Dear Khalil, Kisses and longing, I am asking from the child Jesus to make these two holidays of christmas and new year to make them many and that you will have health and peace. Reassure me of your well-being and don't forget to write to me. Kisses to you God’s Blessing.'",,"Kail Ellis","Moise A. Khayrallah Center for Lebanese Diaspora Studies",undated,,"The donor retains full ownership of any copyright and rights currently controlled. Nonexclusive right to authorize uses of these materials for non-commercial research, scholarly, or other educational purposes are granted to Khayrallah Center pursuant to U.S. Copyright Law. Usage of the materials for these purposes must be fully credited with the source. The user assumes full responsibility for any use of the materials.",,Text/pdf,Arabic,Text,KEllis2020-265,,,,,,,,,,,,,,,,,,,,,,,,,,,,,,,,,,,,,,,,,,,,,,,,,,,,,,,,,,,,,,,,,,,,,,,,,,,,,,"Christmas,Letters-Arabic",https://lebanesestudies.omeka.chass.ncsu.edu/files/original/3beb6e643e5f776221b7aa4d61d1d114.pdf,,"Kmeid-Ellis Collection Series 1: Correspondence and Documents",1,0
85773,https://lebanesestudies.omeka.chass.ncsu.edu/items/show/85773,,,,,,,,,,,,,,,,,,,,,,,,,,,,,,,,,,,,,,,,,"Christmas Card from Yousef Hobeiche to Angele Ellis, 1926 December 5","Correspondence^^Christmas Cards^^Christmas","A Christmas card from Yousef Hobeiche to Angele and Toufic Ellis, dated 5 December 1926.","Yousef Hobeiche","Kail Ellis","Moise A. Khayrallah Center for Lebanese Diaspora Studies","1926 December 05",,"The donor retains full ownership of any copyright and rights currently controlled. Nonexclusive right to authorize uses of these materials for non-commercial research, scholarly, or other educational purposes are granted to Khayrallah Center pursuant to U.S. Copyright Law. Usage of the materials for these purposes must be fully credited with the source. The user assumes full responsibility for any use of the materials.",,Text/pdf,Arabic,Text,KEllis2018-032,,,,,,,,,,,,,,,,,,,,,,,,,,,,,,,,,,,,,,,,,,,,,,,,,,,,,,,,,,,,,,,,,,,,,,,,,,,,,,"1920s,Christmas,Lebanon,Letters-Arabic",https://lebanesestudies.omeka.chass.ncsu.edu/files/original/91397651b9d3494f5bc33affa3e4b636.pdf,,"Kmeid-Ellis Collection Series 1: Correspondence and Documents",1,0
82348,https://lebanesestudies.omeka.chass.ncsu.edu/items/show/82348,,,,,,,,,,,,,,,,,,,,,,,,,,,,,,,,,,,,,,,,,"Christmas Card with Four Children, 1947","Lebanese--United States^^ Photographs^^ Families","A Christmas card featuring four children, listed as Amin, Ferad, Lanie, and Nadir, with a note from them to their grandfather, Daoud or David. ","Albert Beyrouth","Oussani Fuleihan family","Moise A. Khayrallah Center for Lebanese Diaspora Studies","1947 Dec 9",,"The donor retains full ownership of any copyright and rights currently controlled. Nonexclusive right to authorize uses of these materials for non-commercial research, scholarly, or other educational purposes are granted to Khayrallah Center pursuant to U.S. Copyright Law. Usage of the materials for these purposes must be fully credited with the source. The user assumes full responsibility for any use of the materials.",,Image/pdf,,Image,Oussani2018-0873,,,,,,,,,,,,,,,,,,,,,,,,,,,,,,,,,,,,,,,,,,,,,,,,,,,,,,,,,,,,,,,,,,,,,,,,,,,,,,"1940s,Christmas,Families",https://lebanesestudies.omeka.chass.ncsu.edu/files/original/3dbd6426798de16e4d9318be5bb579bc.pdf,,"Oussani and Fuleihan Family Papers Series 2: Photographs",1,0
85068,https://lebanesestudies.omeka.chass.ncsu.edu/items/show/85068,,,,,,,,,,,,,,,,,,,,,,,,,,,,,,,,,,,,,,,,,"Christmas Card with John Ledwig Gebhard Lund Artwork","Letter writing, Arabic^^Holiday Cards^^Correspondence","Christmas Card with John Ledwig Gebhard Lund Artwork on the front. Arabic section: sender sends receivers season greetings and best wishes.",,"Kail Ellis","Moise A. Khayrallah Center for Lebanese Diaspora Studies",undated,,"The donor retains full ownership of any copyright and rights currently controlled. Nonexclusive right to authorize uses of these materials for non-commercial research, scholarly, or other educational purposes are granted to Khayrallah Center pursuant to U.S. Copyright Law. Usage of the materials for these purposes must be fully credited with the source. The user assumes full responsibility for any use of the materials.",,Text/pdf,Arabic,Text,KEllis2020-242,,,,,,,,,,,,,,,,,,,,,,,,,,,,,,,,,,,,,,,,,,,,,,,,,,,,,,,,,,,,,,,,,,,,,,,,,,,,,,Christmas,https://lebanesestudies.omeka.chass.ncsu.edu/files/original/411c7642cde1f4ce80789e2a55b0fa1d.pdf,,"Kmeid-Ellis Collection Series 1: Correspondence and Documents",1,0
82285,https://lebanesestudies.omeka.chass.ncsu.edu/items/show/82285,,,,,,,,,,,,,,,,,,,,,,,,,,,,,,,,,,,,,,,,,"Christmas Card with Pictures of Rosemarie Fuleihan","Lebanese--United States^^ Photographs^^ Families","A Christmas card from Rosemarie and Michael Fuleihan, who were married in 1959. Includes two photos of Rosemarie.",,"Oussani Fuleihan family","Moise A. Khayrallah Center for Lebanese Diaspora Studies",1959,,"The donor retains full ownership of any copyright and rights currently controlled. Nonexclusive right to authorize uses of these materials for non-commercial research, scholarly, or other educational purposes are granted to Khayrallah Center pursuant to U.S. Copyright Law. Usage of the materials for these purposes must be fully credited with the source. The user assumes full responsibility for any use of the materials.",,Image/pdf,English,Image,Oussani2018-0937,,,,,,,,,,,,,,,,,,,,,,,,,,,,,,,,,,,,,,,,,,,,,,,,,,,,,,,,,,,,,,,,,,,,,,,,,,,,,,"1950s,Christmas",https://lebanesestudies.omeka.chass.ncsu.edu/files/original/0763dedb7b2fdb4aa6e544fb71fe65e7.pdf,,"Oussani and Fuleihan Family Papers Series 2: Photographs",1,0
82094,https://lebanesestudies.omeka.chass.ncsu.edu/items/show/82094,,,,,,,,,,,,,,,,,,,,,,,,,,,,,,,,,,,,,,,,,"Christmas Card, 1936",Correspondence,"A Christmas card sent to Mrs. Oussani, postmarked 1936, still in original envelope. The card features a drawing of the pyramids in Egypt and says ""Wishing You a Happy Christmas and a Bright New Year.""",,"Oussani Fuleihan family","Moise A. Khayrallah Center for Lebanese Diaspora Studies","1936 December 15",,"The donor retains full ownership of any copyright and rights currently controlled. Nonexclusive right to authorize uses of these materials for non-commercial research, scholarly, or other educational purposes are granted to Khayrallah Center pursuant to U.S. Copyright Law. Usage of the materials for these purposes must be fully credited with the source. The user assumes full responsibility for any use of the materials.",,Text/pdf,English,Text,Oussani2018-0365,,,,,,,,,,,,,,,,,,,,,,,,,,,,,,,,,,,,,,,,,,,,,,,,,,,,,,,,,,,,,,,,,,,,,,,,,,,,,,"1930s,Christmas,Egypt",https://lebanesestudies.omeka.chass.ncsu.edu/files/original/afd64c67b500bd4375f5b9239b409ec2.pdf,,"Oussani and Fuleihan Family Papers Series 1: Documents",1,0