﻿"Item Id","Item URI","Dublin Core:Alternative Title","Dublin Core:Abstract","Dublin Core:Table Of Contents","Dublin Core:Date Available","Dublin Core:Date Created","Dublin Core:Date Accepted","Dublin Core:Date Copyrighted","Dublin Core:Date Submitted","Dublin Core:Date Issued","Dublin Core:Date Modified","Dublin Core:Date Valid","Dublin Core:Access Rights","Dublin Core:License","Dublin Core:Conforms To","Dublin Core:Has Format","Dublin Core:Has Part","Dublin Core:Has Version","Dublin Core:Is Format Of","Dublin Core:Is Part Of","Dublin Core:Is Referenced By","Dublin Core:Is Replaced By","Dublin Core:Is Required By","Dublin Core:Is Version Of","Dublin Core:References","Dublin Core:Replaces","Dublin Core:Requires","Dublin Core:Extent","Dublin Core:Medium","Dublin Core:Bibliographic Citation","Dublin Core:Spatial Coverage","Dublin Core:Temporal Coverage","Dublin Core:Accrual Method","Dublin Core:Accrual Periodicity","Dublin Core:Accrual Policy","Dublin Core:Audience","Dublin Core:Audience Education Level","Dublin Core:Mediator","Dublin Core:Instructional Method","Dublin Core:Provenance","Dublin Core:Rights Holder","Dublin Core:Title","Dublin Core:Subject","Dublin Core:Description","Dublin Core:Creator","Dublin Core:Source","Dublin Core:Publisher","Dublin Core:Date","Dublin Core:Contributor","Dublin Core:Rights","Dublin Core:Relation","Dublin Core:Format","Dublin Core:Language","Dublin Core:Type","Dublin Core:Identifier","Dublin Core:Coverage","Item Type Metadata:Text","Item Type Metadata:Interviewer","Item Type Metadata:Interviewee","Item Type Metadata:Location","Item Type Metadata:Transcription","Item Type Metadata:Local URL","Item Type Metadata:Original Format","Item Type Metadata:Physical Dimensions","Item Type Metadata:Duration","Item Type Metadata:Compression","Item Type Metadata:Producer","Item Type Metadata:Director","Item Type Metadata:Bit Rate/Frequency","Item Type Metadata:Time Summary","Item Type Metadata:Email Body","Item Type Metadata:Subject Line","Item Type Metadata:From","Item Type Metadata:To","Item Type Metadata:CC","Item Type Metadata:BCC","Item Type Metadata:Number of Attachments","Item Type Metadata:Standards","Item Type Metadata:Objectives","Item Type Metadata:Materials","Item Type Metadata:Lesson Plan Text","Item Type Metadata:URL","Item Type Metadata:Event Type","Item Type Metadata:Participants","Item Type Metadata:Birth Date","Item Type Metadata:Birthplace","Item Type Metadata:Death Date","Item Type Metadata:Occupation","Item Type Metadata:Biographical Text","Item Type Metadata:Bibliography","Item Type Metadata:First Name (English)","Item Type Metadata:Last Name (English)","Item Type Metadata:Address","Item Type Metadata:City","Item Type Metadata:State","Item Type Metadata:Business (English)","Item Type Metadata:Provenance (English)","Item Type Metadata:Provenance (Arabic)","Item Type Metadata:Business (Arabic)","Item Type Metadata:Last Name (Arabic)","Item Type Metadata:First Name (Arabic)","Item Type Metadata:Player","Omeka Legacy File:Additional Creator","Omeka Legacy File:Transcriber","Omeka Legacy File:Producer","Omeka Legacy File:Render Device","Omeka Legacy File:Render Details","Omeka Legacy File:Capture Date","Omeka Legacy File:Capture Device","Omeka Legacy File:Capture Details","Omeka Legacy File:Change History","Omeka Legacy File:Watermark","Omeka Legacy File:Encryption","Omeka Legacy File:Compression","Omeka Legacy File:Post Processing","Omeka Image File:Width","Omeka Image File:Height","Omeka Image File:Bit Depth","Omeka Image File:Channels","Omeka Image File:Exif String","Omeka Image File:Exif Array","Omeka Image File:IPTC String","Omeka Image File:IPTC Array","Omeka Video File:Bitrate","Omeka Video File:Duration","Omeka Video File:Sample Rate","Omeka Video File:Codec","Omeka Video File:Width","Omeka Video File:Height","PDF Text:Text","Users Elements:Test","Test Elements:Test",tags,file,itemType,collection,public,featured
68539,https://lebanesestudies.omeka.chass.ncsu.edu/items/show/68539,,,,,,,,,,,,,,,,,,,,,,,,,,,,,,,,,,,,,,,,,"Postcard from [unsigned] to Toufic Ellis, 1972 February 10","Postcards^^ Correspondence","A postcard from [unsigned] to Toufic Ellis, dated 10 February 1972. 'Weather is bad. Don't send newspapers. We received a letter form Agnese today'. ",,"Kail Ellis","Moise A. Khayrallah Center for Lebanese Diaspora Studies",1972-02-10,,"Donor retains full ownership of any and all copyright currently controlled in agreement with Khayrallah Center. Nonexclusive right to authorize all uses of these materials for non-commercial research, scholarly, or other educational purposes are granted to Khayrallah Center pursuant to Creative Commons Attribution-NonCommercial-ShareAlike (CC BY-NC-SA).",,Image/pdf,English^^Arabic,Text,KEllis2020-137,,,,,,,,,,,,,,,,,,,,,,,,,,,,,,,,,,,,,,,,,,,,,,,,,,,,,,,,,,,,,,,,,,,,,,,,,,,,,,"1970s,Toufic Ellis",https://lebanesestudies.omeka.chass.ncsu.edu/files/original/722e605be7d70766f057ffd5e93357a9.pdf,,"Angele Hobeiche Kmeid-Ellis Collection: Correspondence",1,1
68533,https://lebanesestudies.omeka.chass.ncsu.edu/items/show/68533,,,,,,,,,,,,,,,,,,,,,,,,,,,,,,,,,,,,,,,,,"Postcard from Angele Ellis to Kail Ellis, 1973 January 9","Postcards^^ Correspondence","A postcard from Angele Ellis to Kail Ellis, dated 9 January 1973.","Angele Ellis","Kail Ellis","Moise A. Khayrallah Center for Lebanese Diaspora Studies",1973-01-09,,"Donor retains full ownership of any and all copyright currently controlled in agreement with Khayrallah Center. Nonexclusive right to authorize all uses of these materials for non-commercial research, scholarly, or other educational purposes are granted to Khayrallah Center pursuant to Creative Commons Attribution-NonCommercial-ShareAlike (CC BY-NC-SA).",,Image/pdf,English,Text,KEllis2020-139,,,,,,,,,,,,,,,,,,,,,,,,,,,,,,,,,,,,,,,,,,,,,,,,,,,,,,,,,,,,,,,,,,,,,,,,,,,,,,"1970s,Angele Ellis,Kail Ellis",https://lebanesestudies.omeka.chass.ncsu.edu/files/original/e15840869035c5311cf49622fc038f34.pdf,,"Angele Hobeiche Kmeid-Ellis Collection: Correspondence",1,1
68531,https://lebanesestudies.omeka.chass.ncsu.edu/items/show/68531,,,,,,,,,,,,,,,,,,,,,,,,,,,,,,,,,,,,,,,,,"Postcard and Letter from Angele Ellis to Kail Ellis, 1973 July 11","Postcards^^ Correspondence","A postcard and letter from Angele Ellis to Kail Ellis, dated 11 July 1973. Angele tells Kail that she forgot what he told her about his travel over the phone. She sends him phone numbers and addresses of people in Lebanon. ","Angele Ellis","Kail Ellis","Moise A. Khayrallah Center for Lebanese Diaspora Studies",1973-07-11,,"Donor retains full ownership of any and all copyright currently controlled in agreement with Khayrallah Center. Nonexclusive right to authorize all uses of these materials for non-commercial research, scholarly, or other educational purposes are granted to Khayrallah Center pursuant to Creative Commons Attribution-NonCommercial-ShareAlike (CC BY-NC-SA).",,Image/pdf,English^^Arabic,Text,KEllis2020-140,,,,,,,,,,,,,,,,,,,,,,,,,,,,,,,,,,,,,,,,,,,,,,,,,,,,,,,,,,,,,,,,,,,,,,,,,,,,,,"1970s,Angele Ellis,Kail Ellis",https://lebanesestudies.omeka.chass.ncsu.edu/files/original/f7681b94517018cef04d74e8998bdd5e.pdf,,"Angele Hobeiche Kmeid-Ellis Collection: Correspondence",1,1
68526,https://lebanesestudies.omeka.chass.ncsu.edu/items/show/68526,,,,,,,,,,,,,,,,,,,,,,,,,,,,,,,,,,,,,,,,,"Postcard from Yousef Hobeiche to Angele Ellis, 1973-1974. ","Postcards^^ Correspondence","A postcard written in Arabic from Yousef Hobeiche to Angele Ellis for the occasion of Christmas and New Year 1973-1974. ","Yousef Hobeiche","Kail Ellis","Moise A. Khayrallah Center for Lebanese Diaspora Studies",1973-12,,"Donor retains full ownership of any and all copyright currently controlled in agreement with Khayrallah Center. Nonexclusive right to authorize all uses of these materials for non-commercial research, scholarly, or other educational purposes are granted to Khayrallah Center pursuant to Creative Commons Attribution-NonCommercial-ShareAlike (CC BY-NC-SA).",,Image/pdf,Arabic,Text,KEllis2020-141,,,,,,,,,,,,,,,,,,,,,,,,,,,,,,,,,,,,,,,,,,,,,,,,,,,,,,,,,,,,,,,,,,,,,,,,,,,,,,,https://lebanesestudies.omeka.chass.ncsu.edu/files/original/15f77d28238a5db7bf767e543be7ffe0.pdf,,"Angele Hobeiche Kmeid-Ellis Collection: Correspondence",1,1
68519,https://lebanesestudies.omeka.chass.ncsu.edu/items/show/68519,,,,,,,,,,,,,,,,,,,,,,,,,,,,,,,,,,,,,,,,,"Postcard from Angele Ellis to Kail Ellis, 1974 April 23","Postcards^^ Correspondence","A postcard from Angele Ellis to Kail Ellis, dated 23 April 1974.","Angele Ellis","Kail Ellis","Moise A. Khayrallah Center for Lebanese Diaspora Studies",1974-04-23,,"Donor retains full ownership of any and all copyright currently controlled in agreement with Khayrallah Center. Nonexclusive right to authorize all uses of these materials for non-commercial research, scholarly, or other educational purposes are granted to Khayrallah Center pursuant to Creative Commons Attribution-NonCommercial-ShareAlike (CC BY-NC-SA).",,Image/pdf,English,Text,KEllis2020-143,,,,,,,,,,,,,,,,,,,,,,,,,,,,,,,,,,,,,,,,,,,,,,,,,,,,,,,,,,,,,,,,,,,,,,,,,,,,,,"1970s,Angele Ellis,Kail Ellis",https://lebanesestudies.omeka.chass.ncsu.edu/files/original/b176dc4d92d1213f771e34e07911235b.pdf,,"Angele Hobeiche Kmeid-Ellis Collection: Correspondence",1,1
68517,https://lebanesestudies.omeka.chass.ncsu.edu/items/show/68517,,,,,,,,,,,,,,,,,,,,,,,,,,,,,,,,,,,,,,,,,"Postcard from Angele Ellis to Angele Ellis and Toufic Ellis, 1974 July 26","Postcards^^ Correspondence","A postcard from Angele Ellis to her grandparents, Angele Ellis and Toufic Ellis, dated 26 July 1974.","Angele Ellis","Kail Ellis","Moise A. Khayrallah Center for Lebanese Diaspora Studies",1974-07-26,,"Donor retains full ownership of any and all copyright currently controlled in agreement with Khayrallah Center. Nonexclusive right to authorize all uses of these materials for non-commercial research, scholarly, or other educational purposes are granted to Khayrallah Center pursuant to Creative Commons Attribution-NonCommercial-ShareAlike (CC BY-NC-SA).",,Image/pdf,English,Text,KEllis2020-145,,,,,,,,,,,,,,,,,,,,,,,,,,,,,,,,,,,,,,,,,,,,,,,,,,,,,,,,,,,,,,,,,,,,,,,,,,,,,,"1970s,Angele Ellis,Toufic Ellis",https://lebanesestudies.omeka.chass.ncsu.edu/files/original/3ddd8421b9f21091c2cc8aa627fc7224.pdf,,"Angele Hobeiche Kmeid-Ellis Collection: Correspondence",1,1
68512,https://lebanesestudies.omeka.chass.ncsu.edu/items/show/68512,,,,,,,,,,,,,,,,,,,,,,,,,,,,,,,,,,,,,,,,,"Postcard from Angele Ellis to Kail Ellis, 1976 February 13","Postcards^^ Correspondence","A postcard from Angele Ellis to Kail Ellis, dated 13 February 1976.","Angele Ellis","Kail Ellis","Moise A. Khayrallah Center for Lebanese Diaspora Studies",1976-02-13,,"Donor retains full ownership of any and all copyright currently controlled in agreement with Khayrallah Center. Nonexclusive right to authorize all uses of these materials for non-commercial research, scholarly, or other educational purposes are granted to Khayrallah Center pursuant to Creative Commons Attribution-NonCommercial-ShareAlike (CC BY-NC-SA).",,Image/pdf,English^^Arabic,Text,KEllis2020-147,,,,,,,,,,,,,,,,,,,,,,,,,,,,,,,,,,,,,,,,,,,,,,,,,,,,,,,,,,,,,,,,,,,,,,,,,,,,,,"1970s,Angele Ellis,Kail Ellis",https://lebanesestudies.omeka.chass.ncsu.edu/files/original/7ac0d8041513389c3684283ac18f4ed3.pdf,,"Angele Hobeiche Kmeid-Ellis Collection: Correspondence",1,1
68506,https://lebanesestudies.omeka.chass.ncsu.edu/items/show/68506,,,,,,,,,,,,,,,,,,,,,,,,,,,,,,,,,,,,,,,,,"Postcard from Kail Ellis to Angele Ellis and Toufic Ellis, 1977 June 7","Postcards^^ Correspondence","Postcard from Kail Ellis to Angele Ellis and Toufic Ellis, dated 7 June 1977.","Kail Ellis","Kail Ellis","Moise A. Khayrallah Center for Lebanese Diaspora Studies",1977-06-07,,"Donor retains full ownership of any and all copyright currently controlled in agreement with Khayrallah Center. Nonexclusive right to authorize all uses of these materials for non-commercial research, scholarly, or other educational purposes are granted to Khayrallah Center pursuant to Creative Commons Attribution-NonCommercial-ShareAlike (CC BY-NC-SA).",,Image/pdf,English,Text,KEllis2020-149,,,,,,,,,,,,,,,,,,,,,,,,,,,,,,,,,,,,,,,,,,,,,,,,,,,,,,,,,,,,,,,,,,,,,,,,,,,,,,"1970s,Angele Ellis,Kail Ellis,Toufic Ellis",https://lebanesestudies.omeka.chass.ncsu.edu/files/original/cbe35082c8bfa7579e51f29550ae0e76.pdf,,"Angele Hobeiche Kmeid-Ellis Collection: Correspondence",1,1
68495,https://lebanesestudies.omeka.chass.ncsu.edu/items/show/68495,,,,,,,,,,,,,,,,,,,,,,,,,,,,,,,,,,,,,,,,,"Postcard from Angele Ellis, 1979 November 6","Postcards^^ Correspondence","Postcard from Angele Ellis, dated 1979 November 6","Angele Ellis","Kail Ellis","Moise A. Khayrallah Center for Lebanese Diaspora Studies",1979-11-06,,"Donor retains full ownership of any and all copyright currently controlled in agreement with Khayrallah Center. Nonexclusive right to authorize all uses of these materials for non-commercial research, scholarly, or other educational purposes are granted to Khayrallah Center pursuant to Creative Commons Attribution-NonCommercial-ShareAlike (CC BY-NC-SA).",,Image/pdf,English,Text,KEllis2020-154,,,,,,,,,,,,,,,,,,,,,,,,,,,,,,,,,,,,,,,,,,,,,,,,,,,,,,,,,,,,,,,,,,,,,,,,,,,,,,"1970s,Angele Ellis",https://lebanesestudies.omeka.chass.ncsu.edu/files/original/fb7a8b8d7ccb32a76fdc5a2e94ed97c7.pdf,,"Angele Hobeiche Kmeid-Ellis Collection: Correspondence",1,1
68481,https://lebanesestudies.omeka.chass.ncsu.edu/items/show/68481,,,,,,,,,,,,,,,,,,,,,,,,,,,,,,,,,,,,,,,,,"Envelope and Postcard from Angele Ellis to Kail Ellis, 1981 July 17","Postcards^^ Correspondence","An envelope and 3D postcard addressed from Angele Ellis to Kail Ellis, dated 1981 July 17. Arabic below: locations of where 'bombs are falling' in Ghazir, Kfour, Boqaata, and Mazra'a in Lebanon. ","Angele Ellis","Kail Ellis","Moise A. Khayrallah Center for Lebanese Diaspora Studies",1981-07-17,,"Donor retains full ownership of any and all copyright currently controlled in agreement with Khayrallah Center. Nonexclusive right to authorize all uses of these materials for non-commercial research, scholarly, or other educational purposes are granted to Khayrallah Center pursuant to Creative Commons Attribution-NonCommercial-ShareAlike (CC BY-NC-SA).",,Image/pdf,"English, Arabic",Text,KEllis2020-160,,,,,,,,,,,,,,,,,,,,,,,,,,,,,,,,,,,,,,,,,,,,,,,,,,,,,,,,,,,,,,,,,,,,,,,,,,,,,,"1980s,Angele Ellis,Carthage, NY,Christ at Gethsemane,Kail Ellis,Postcards",https://lebanesestudies.omeka.chass.ncsu.edu/files/original/4193295c82d3442882e14dc6c3c4446d.pdf,,"Angele Hobeiche Kmeid-Ellis Collection: Correspondence",1,1
68476,https://lebanesestudies.omeka.chass.ncsu.edu/items/show/68476,,,,,,,,,,,,,,,,,,,,,,,,,,,,,,,,,,,,,,,,,"Postcard from Marie Theresa Ellis to Kail Ellis, 1981 October 8","Postcards^^ Correspondence","A postcard from Rome addressed to Kail Ellis from Marie Theresa Ellis, dated 1981 October 8.","Marie Theresa Ellis","Kail Ellis","Moise A. Khayrallah Center for Lebanese Diaspora Studies",1981-10-08,,"Donor retains full ownership of any and all copyright currently controlled in agreement with Khayrallah Center. Nonexclusive right to authorize all uses of these materials for non-commercial research, scholarly, or other educational purposes are granted to Khayrallah Center pursuant to Creative Commons Attribution-NonCommercial-ShareAlike (CC BY-NC-SA).",,Image/pdf,English,Text,KEllis2020-164,,,,,,,,,,,,,,,,,,,,,,,,,,,,,,,,,,,,,,,,,,,,,,,,,,,,,,,,,,,,,,,,,,,,,,,,,,,,,,"1980s,Kail Ellis,Marie Theresa Ellis,Rome,Vatican",https://lebanesestudies.omeka.chass.ncsu.edu/files/original/1994a77572d676f53284a492f8767560.pdf,,"Angele Hobeiche Kmeid-Ellis Collection: Correspondence",1,1
68456,https://lebanesestudies.omeka.chass.ncsu.edu/items/show/68456,,,,,,,,,,,,,,,,,,,,,,,,,,,,,,,,,,,,,,,,,"Postcard from Angele Ellis to Kail Ellis, 1983 March 13","Postcards^^ Correspondence","A postcard addressed from Angele Ellis to Kail Ellis, dated 1983 March 13. Arabic section: Alfred and wife return to Carthage and stay after operation. ","Angele Ellis","Kail Ellis","Moise A. Khayrallah Center for Lebanese Diaspora Studies",1983-03-13,,"Donor retains full ownership of any and all copyright currently controlled in agreement with Khayrallah Center. Nonexclusive right to authorize all uses of these materials for non-commercial research, scholarly, or other educational purposes are granted to Khayrallah Center pursuant to Creative Commons Attribution-NonCommercial-ShareAlike (CC BY-NC-SA).",,Image/pdf,"English, Arabic",Text,KEllis2020-180,,,,,,,,,,,,,,,,,,,,,,,,,,,,,,,,,,,,,,,,,,,,,,,,,,,,,,,,,,,,,,,,,,,,,,,,,,,,,,"1980s,Angele Ellis,Kail Ellis,Postcards,Rochester, NY",https://lebanesestudies.omeka.chass.ncsu.edu/files/original/558441c896638a4fd023d2b643338b82.pdf,,"Angele Hobeiche Kmeid-Ellis Collection: Correspondence",1,1
68455,https://lebanesestudies.omeka.chass.ncsu.edu/items/show/68455,,,,,,,,,,,,,,,,,,,,,,,,,,,,,,,,,,,,,,,,,"Postcard from Angele Ellis to Kail Ellis, 1983 March 14","Postcards^^ Correspondence","A postcard addressed from Angele Ellis to Kail Ellis, dated 1983 March 14. Alfreda left on Sunday, Angele hasn't heard from her and doesn't know how will she come. ","Angele Ellis","Kail Ellis","Moise A. Khayrallah Center for Lebanese Diaspora Studies",1983-03-14,,"Donor retains full ownership of any and all copyright currently controlled in agreement with Khayrallah Center. Nonexclusive right to authorize all uses of these materials for non-commercial research, scholarly, or other educational purposes are granted to Khayrallah Center pursuant to Creative Commons Attribution-NonCommercial-ShareAlike (CC BY-NC-SA).",,Image/pdf,"English, Arabic",Text,KEllis2020-181,,,,,,,,,,,,,,,,,,,,,,,,,,,,,,,,,,,,,,,,,,,,,,,,,,,,,,,,,,,,,,,,,,,,,,,,,,,,,,"1980s,Angele Ellis,Kail Ellis,Postcards,Rochester, NY",https://lebanesestudies.omeka.chass.ncsu.edu/files/original/2e3944cedda7e1d0866bced05dbcbdac.pdf,,"Angele Hobeiche Kmeid-Ellis Collection: Correspondence",1,1
68453,https://lebanesestudies.omeka.chass.ncsu.edu/items/show/68453,,,,,,,,,,,,,,,,,,,,,,,,,,,,,,,,,,,,,,,,,"Postcard from Angele Ellis to Kail Ellis, 1984 January 25","Postcards^^ Correspondence","A postcard addressed from Angele Ellis to Kail Ellis, dated 1984 January 25","Angele Ellis","Kail Ellis","Moise A. Khayrallah Center for Lebanese Diaspora Studies",1984-01-25,,"Donor retains full ownership of any and all copyright currently controlled in agreement with Khayrallah Center. Nonexclusive right to authorize all uses of these materials for non-commercial research, scholarly, or other educational purposes are granted to Khayrallah Center pursuant to Creative Commons Attribution-NonCommercial-ShareAlike (CC BY-NC-SA).",,Image/pdf,English,Text,KEllis2020-182,,,,,,,,,,,,,,,,,,,,,,,,,,,,,,,,,,,,,,,,,,,,,,,,,,,,,,,,,,,,,,,,,,,,,,,,,,,,,,"1980s,Angele Ellis,Kail Ellis,Miami, FL",https://lebanesestudies.omeka.chass.ncsu.edu/files/original/daf502234523b678d93b5e87be5388d0.pdf,,"Angele Hobeiche Kmeid-Ellis Collection: Correspondence",1,1
68450,https://lebanesestudies.omeka.chass.ncsu.edu/items/show/68450,,,,,,,,,,,,,,,,,,,,,,,,,,,,,,,,,,,,,,,,,"Postcard from Farria Afifa to Toufic Ellis and Angele Ellis, 1985 August 13","Postcards^^ Correspondence","A postcard from Farria Afifa to Toufic Ellis and Angele Ellis, dated 13 August 1985.","Farria Afifa","Kail Ellis","Moise A. Khayrallah Center for Lebanese Diaspora Studies",1985-08-13,,"Donor retains full ownership of any and all copyright currently controlled in agreement with Khayrallah Center. Nonexclusive right to authorize all uses of these materials for non-commercial research, scholarly, or other educational purposes are granted to Khayrallah Center pursuant to Creative Commons Attribution-NonCommercial-ShareAlike (CC BY-NC-SA).",,Text/pdf,Arabic,Text,KEllis2018-308,,,,,,,,,,,,,,,,,,,,,,,,,,,,,,,,,,,,,,,,,,,,,,,,,,,,,,,,,,,,,,,,,,,,,,,,,,,,,,"1980s,Afifa,Angele Ellis,Ellis,Farria Afifa,Paris, France,Toufic Ellis",https://lebanesestudies.omeka.chass.ncsu.edu/files/original/8fe9f90d87ff49981a243b26cb4e39f1.pdf,,"Angele Hobeiche Kmeid-Ellis Collection: Correspondence",1,1
68446,https://lebanesestudies.omeka.chass.ncsu.edu/items/show/68446,,,,,,,,,,,,,,,,,,,,,,,,,,,,,,,,,,,,,,,,,"Postcard to Toufic Ellis and Angele Ellis Ellis from Italy, 1986 March 12","Postcards^^ Correspondence","A postcard addressed to Toufic Ellis and Angele Ellis from Italy, dated 12 March 1986",,"Kail Ellis","Moise A. Khayrallah Center for Lebanese Diaspora Studies",1986-03-12,,"Donor retains full ownership of any and all copyright currently controlled in agreement with Khayrallah Center. Nonexclusive right to authorize all uses of these materials for non-commercial research, scholarly, or other educational purposes are granted to Khayrallah Center pursuant to Creative Commons Attribution-NonCommercial-ShareAlike (CC BY-NC-SA).",,Image/pdf,English,Text,KEllis2020-188,,,,,,,,,,,,,,,,,,,,,,,,,,,,,,,,,,,,,,,,,,,,,,,,,,,,,,,,,,,,,,,,,,,,,,,,,,,,,,"1980s,Angele Ellis,Italy,Toufic Ellis",https://lebanesestudies.omeka.chass.ncsu.edu/files/original/aa9d128e33fd4ec7429157f4ab76f84b.pdf,,"Angele Hobeiche Kmeid-Ellis Collection: Correspondence",1,1
68442,https://lebanesestudies.omeka.chass.ncsu.edu/items/show/68442,,,,,,,,,,,,,,,,,,,,,,,,,,,,,,,,,,,,,,,,,"Postcard from Namtallah Hobeiche to Angele Ellis and Toufic Ellis, 1986 June 28","Postcards^^ Correspondence","A postcard from Namtallah Hobeiche to addressed to Mrs. Angele Ellis, 514 West Street, Carthage, N.Y., 13619, U.S.A.,, dated 28 June 1986. Sent by Airmail from Paris, France. Contains two French stamps.","Namtallah Hobeiche","Kail Ellis","Moise A. Khayrallah Center for Lebanese Diaspora Studies",1986-06-28,,"Donor retains full ownership of any and all copyright currently controlled in agreement with Khayrallah Center. Nonexclusive right to authorize all uses of these materials for non-commercial research, scholarly, or other educational purposes are granted to Khayrallah Center pursuant to Creative Commons Attribution-NonCommercial-ShareAlike (CC BY-NC-SA).",,Text/pdf,Arabic,Text,KEllis2018-310,,,,,,,,,,,,,,,,,,,,,,,,,,,,,,,,,,,,,,,,,,,,,,,,,,,,,,,,,,,,,,,,,,,,,,,,,,,,,,"1980s,Angele Ellis,Ellis,Hobeiche,Namtallah Hobeiche,Paris, France,Postcards,Sacré-Coeur de Montmartre,Stamps,Toufic Ellis",https://lebanesestudies.omeka.chass.ncsu.edu/files/original/831ed4f20627a289d8dc78ec9e01c4b6.pdf,,"Angele Hobeiche Kmeid-Ellis Collection: Correspondence",1,1
68390,https://lebanesestudies.omeka.chass.ncsu.edu/items/show/68390,,,,,,,,,,,,,,,,,,,,,,,,,,,,,,,,,,,,,,,,,"Postcard from John Rotelle to Sister Marie Angele, 1995 September 14","Postcards^^ Correspondence","Postcard addressed to Sister Marie Angele from John Rotelle, dated 1995 September 14","John Rotelle","Kail Ellis","Moise A. Khayrallah Center for Lebanese Diaspora Studies",1995-09-14,,"Donor retains full ownership of any and all copyright currently controlled in agreement with Khayrallah Center. Nonexclusive right to authorize all uses of these materials for non-commercial research, scholarly, or other educational purposes are granted to Khayrallah Center pursuant to Creative Commons Attribution-NonCommercial-ShareAlike (CC BY-NC-SA).",,Image/pdf,English,Text,KEllis2020-229,,,,,,,,,,,,,,,,,,,,,,,,,,,,,,,,,,,,,,,,,,,,,,,,,,,,,,,,,,,,,,,,,,,,,,,,,,,,,,"1990s,John Rotelle,Rome,Sister Marie Angele,Travel,Work",https://lebanesestudies.omeka.chass.ncsu.edu/files/original/478bf64fa778335bab7cf3424196f9d5.pdf,,"Angele Hobeiche Kmeid-Ellis Collection: Correspondence",1,1