﻿"Item Id","Item URI","Dublin Core:Alternative Title","Dublin Core:Abstract","Dublin Core:Table Of Contents","Dublin Core:Date Available","Dublin Core:Date Created","Dublin Core:Date Accepted","Dublin Core:Date Copyrighted","Dublin Core:Date Submitted","Dublin Core:Date Issued","Dublin Core:Date Modified","Dublin Core:Date Valid","Dublin Core:Access Rights","Dublin Core:License","Dublin Core:Conforms To","Dublin Core:Has Format","Dublin Core:Has Part","Dublin Core:Has Version","Dublin Core:Is Format Of","Dublin Core:Is Part Of","Dublin Core:Is Referenced By","Dublin Core:Is Replaced By","Dublin Core:Is Required By","Dublin Core:Is Version Of","Dublin Core:References","Dublin Core:Replaces","Dublin Core:Requires","Dublin Core:Extent","Dublin Core:Medium","Dublin Core:Bibliographic Citation","Dublin Core:Spatial Coverage","Dublin Core:Temporal Coverage","Dublin Core:Accrual Method","Dublin Core:Accrual Periodicity","Dublin Core:Accrual Policy","Dublin Core:Audience","Dublin Core:Audience Education Level","Dublin Core:Mediator","Dublin Core:Instructional Method","Dublin Core:Provenance","Dublin Core:Rights Holder","Dublin Core:Title","Dublin Core:Subject","Dublin Core:Description","Dublin Core:Creator","Dublin Core:Source","Dublin Core:Publisher","Dublin Core:Date","Dublin Core:Contributor","Dublin Core:Rights","Dublin Core:Relation","Dublin Core:Format","Dublin Core:Language","Dublin Core:Type","Dublin Core:Identifier","Dublin Core:Coverage","Item Type Metadata:Text","Item Type Metadata:Interviewer","Item Type Metadata:Interviewee","Item Type Metadata:Location","Item Type Metadata:Transcription","Item Type Metadata:Local URL","Item Type Metadata:Original Format","Item Type Metadata:Physical Dimensions","Item Type Metadata:Duration","Item Type Metadata:Compression","Item Type Metadata:Producer","Item Type Metadata:Director","Item Type Metadata:Bit Rate/Frequency","Item Type Metadata:Time Summary","Item Type Metadata:Email Body","Item Type Metadata:Subject Line","Item Type Metadata:From","Item Type Metadata:To","Item Type Metadata:CC","Item Type Metadata:BCC","Item Type Metadata:Number of Attachments","Item Type Metadata:Standards","Item Type Metadata:Objectives","Item Type Metadata:Materials","Item Type Metadata:Lesson Plan Text","Item Type Metadata:URL","Item Type Metadata:Event Type","Item Type Metadata:Participants","Item Type Metadata:Birth Date","Item Type Metadata:Birthplace","Item Type Metadata:Death Date","Item Type Metadata:Occupation","Item Type Metadata:Biographical Text","Item Type Metadata:Bibliography","Item Type Metadata:First Name (English)","Item Type Metadata:Last Name (English)","Item Type Metadata:Address","Item Type Metadata:City","Item Type Metadata:State","Item Type Metadata:Business (English)","Item Type Metadata:Provenance (English)","Item Type Metadata:Provenance (Arabic)","Item Type Metadata:Business (Arabic)","Item Type Metadata:Last Name (Arabic)","Item Type Metadata:First Name (Arabic)","Item Type Metadata:Player","Omeka Legacy File:Additional Creator","Omeka Legacy File:Transcriber","Omeka Legacy File:Producer","Omeka Legacy File:Render Device","Omeka Legacy File:Render Details","Omeka Legacy File:Capture Date","Omeka Legacy File:Capture Device","Omeka Legacy File:Capture Details","Omeka Legacy File:Change History","Omeka Legacy File:Watermark","Omeka Legacy File:Encryption","Omeka Legacy File:Compression","Omeka Legacy File:Post Processing","Omeka Image File:Width","Omeka Image File:Height","Omeka Image File:Bit Depth","Omeka Image File:Channels","Omeka Image File:Exif String","Omeka Image File:Exif Array","Omeka Image File:IPTC String","Omeka Image File:IPTC Array","Omeka Video File:Bitrate","Omeka Video File:Duration","Omeka Video File:Sample Rate","Omeka Video File:Codec","Omeka Video File:Width","Omeka Video File:Height","PDF Text:Text","Users Elements:Test","Test Elements:Test",tags,file,itemType,collection,public,featured
81880,https://lebanesestudies.omeka.chass.ncsu.edu/items/show/81880,,,,,,,,,,,,,,,,,,,,,,,,,,,,,,,,,,,,,,,,," Kindergarten Class ","Photographs^^ Lebanon","A photo of Phyllis Creighton's Kindergarten class. Phyllis can be seen standing to the left of the teachers. ",,"Phyllis Creighton Danby","Moise A. Khayrallah Center for Lebanese Diaspora Studies","circa 1928",,"The donor retains full ownership of any copyright and rights currently controlled. Nonexclusive right to authorize uses of these materials for non-commercial research, scholarly, or other educational purposes are granted to Khayrallah Center pursuant to U.S. Copyright Law. Usage of the materials for these purposes must be fully credited with the source. The user assumes full responsibility for any use of the materials.",,Image/jpg,,Image,kc0021_068,,,,,,,,,,,,,,,,,,,,,,,,,,,,,,,,,,,,,,,,,,,,,,,,,,,,,,,,,,,,,,,,,,,,,,,,,,,,,,"1920s,Beirut,Education",https://lebanesestudies.omeka.chass.ncsu.edu/files/original/7e66a92fcd3c9dab1ed2a0141301b186.jpg,,"Creighton Family Papers",1,0
79266,https://lebanesestudies.omeka.chass.ncsu.edu/items/show/79266,,,,,,,,,,,,,,,,,,,,,,,,,,,,,,,,,,,,,,,,,"Adults with Baby at Christmas","Photographs^^ Christmas","Vera Khayrallah and her sister posing with the Khayrallah's nephew, Alex, with a Christmas tree in the background.","Moise Khayrallah","Moise and Vera Khayrallah","Moise A. Khayrallah Center for Lebanese Diaspora Studies",1988,,"The donor retains full ownership of any copyright and rights currently controlled. Nonexclusive right to authorize uses of these materials for non-commercial research, scholarly, or other educational purposes are granted to Khayrallah Center pursuant to U.S. Copyright Law. Usage of the materials for these purposes must be fully credited with the source. The user assumes full responsibility for any use of the materials.",,Image/pdf,,Image,kc0036_019,,,,,,,,,,,,,,,,,,,,,,,,,,,,,,,,,,,,,,,,,,,,,,,,,,,,,,,,,,,,,,,,,,,,,,,,,,,,,,"1980s,Christmas,Families",https://lebanesestudies.omeka.chass.ncsu.edu/files/original/4ca2da2fc226e0e06ee305607b976417.pdf,,"Moise and Vera Khayrallah Papers",1,0
79283,https://lebanesestudies.omeka.chass.ncsu.edu/items/show/79283,,,,,,,,,,,,,,,,,,,,,,,,,,,,,,,,,,,,,,,,,"Aerial Shot of Khayrallah Wedding","Photographs^^ Lebanon","An aerial shot of the guests at Moise Khayrallah and Vera Tayeh's wedding. The accompanying caption reads, ""wedding photos of the entire village that came to watch their marriage-over 300 people attended the 'communal wedding.'""",,"Moise and Vera Khayrallah","Moise A. Khayrallah Center for Lebanese Diaspora Studies",1983,,"The donor retains full ownership of any copyright and rights currently controlled. Nonexclusive right to authorize uses of these materials for non-commercial research, scholarly, or other educational purposes are granted to Khayrallah Center pursuant to U.S. Copyright Law. Usage of the materials for these purposes must be fully credited with the source. The user assumes full responsibility for any use of the materials.",,Image/pdf,,Image,kc0036_002,,,,,,,,,,,,,,,,,,,,,,,,,,,,,,,,,,,,,,,,,,,,,,,,,,,,,,,,,,,,,,,,,,,,,,,,,,,,,,"1980s,Lebanon,Weddings",https://lebanesestudies.omeka.chass.ncsu.edu/files/original/815aaf83f5ab2c008a3cec089470f982.pdf,,"Moise and Vera Khayrallah Papers",1,0
81939,https://lebanesestudies.omeka.chass.ncsu.edu/items/show/81939,,,,,,,,,,,,,,,,,,,,,,,,,,,,,,,,,,,,,,,,,"Albert Charles Ellis Receiving Flag in Honor of His Father",Photographs,"A photo of Albert Charles Ellis, youngest son of Albert Ellis, holding a flag after the death of his father. ",,,"Moise A. Khayrallah Center for Lebanese Diaspora Studies",1970,,"The donor retains full ownership of any copyright and rights currently controlled. Nonexclusive right to authorize uses of these materials for non-commercial research, scholarly, or other educational purposes are granted to Khayrallah Center pursuant to U.S. Copyright Law. Usage of the materials for these purposes must be fully credited with the source. The user assumes full responsibility for any use of the materials.",,Image/pdf,,Image,AEllis_024,,,,,,,,,,,,,,,,,,,,,,,,,,,,,,,,,,,,,,,,,,,,,,,,,,,,,,,,,,,,,,,,,,,,,,,,,,,,,,"1970s,portrait",https://lebanesestudies.omeka.chass.ncsu.edu/files/original/ecc0119859bb2d67736ef1300c79fcd2.pdf,,"Albert J. Ellis Papers",1,0
81937,https://lebanesestudies.omeka.chass.ncsu.edu/items/show/81937,,,,,,,,,,,,,,,,,,,,,,,,,,,,,,,,,,,,,,,,,"Albert Charles Ellis with Rev. Father J. Paul Byron in Library Dedicated to his Father",Photographs,"A photo of Charles Ellis and Rev. J. Paul Byron in the Infant of Prague Library reading from an encyclopedia donated by Albert Ellis, Charles's late father. A newspaper article about the library and its dedication to Albert Ellis is linked below. ","Jacksonville Daily News",,"Moise A. Khayrallah Center for Lebanese Diaspora Studies","1970 February ",,"The donor retains full ownership of any copyright and rights currently controlled. Nonexclusive right to authorize uses of these materials for non-commercial research, scholarly, or other educational purposes are granted to Khayrallah Center pursuant to U.S. Copyright Law. Usage of the materials for these purposes must be fully credited with the source. The user assumes full responsibility for any use of the materials.",,Image/pdf,,Image,AEllis_025,,,,,,,,,,,,,,,,,,,,,,,,,,,,,,,,,,,,,,,,,,,,,,,,,,,,,,,,,,,,,,,,,,,,,,,,,,,,,,"1970s,Catholic Church",https://lebanesestudies.omeka.chass.ncsu.edu/files/original/182e99eed0fb26656ac686188f769731.pdf,,"Albert J. Ellis Papers",1,0
81954,https://lebanesestudies.omeka.chass.ncsu.edu/items/show/81954,,,,,,,,,,,,,,,,,,,,,,,,,,,,,,,,,,,,,,,,,"Albert J. Ellis in Suit",Photographs,"A photograph of Albert Ellis with an unidentified man.",,,"Moise A. Khayrallah Center for Lebanese Diaspora Studies",undated,,"The donor retains full ownership of any copyright and rights currently controlled. Nonexclusive right to authorize uses of these materials for non-commercial research, scholarly, or other educational purposes are granted to Khayrallah Center pursuant to U.S. Copyright Law. Usage of the materials for these purposes must be fully credited with the source. The user assumes full responsibility for any use of the materials.",,Image/pdf,English,Image,AEllis_026,,,,,,,,,,,,,,,,,,,,,,,,,,,,,,,,,,,,,,,,,,,,,,,,,,,,,,,,,,,,,,,,,,,,,,,,,,,,,,portrait,https://lebanesestudies.omeka.chass.ncsu.edu/files/original/30b76d4f8102f7e7b2c6e34d33571a59.pdf,,"Albert J. Ellis Papers",1,0
81955,https://lebanesestudies.omeka.chass.ncsu.edu/items/show/81955,,,,,,,,,,,,,,,,,,,,,,,,,,,,,,,,,,,,,,,,,"Albert J. Ellis in Uniform",Photographs,"A photograph of Albert Ellis in uniform with two unidentified people.",,,"Moise A. Khayrallah Center for Lebanese Diaspora Studies",undated,,"The donor retains full ownership of any copyright and rights currently controlled. Nonexclusive right to authorize uses of these materials for non-commercial research, scholarly, or other educational purposes are granted to Khayrallah Center pursuant to U.S. Copyright Law. Usage of the materials for these purposes must be fully credited with the source. The user assumes full responsibility for any use of the materials.",,Image/pdf,English,Image,AEllis_027,,,,,,,,,,,,,,,,,,,,,,,,,,,,,,,,,,,,,,,,,,,,,,,,,,,,,,,,,,,,,,,,,,,,,,,,,,,,,,"Military,portrait",https://lebanesestudies.omeka.chass.ncsu.edu/files/original/9f5f6426a23b86c9ca892aad340d5795.pdf,,"Albert J. Ellis Papers",1,0
81922,https://lebanesestudies.omeka.chass.ncsu.edu/items/show/81922,,,,,,,,,,,,,,,,,,,,,,,,,,,,,,,,,,,,,,,,,"American University of Beirut Campus","Photographs^^ Lebanon","A photo of the American University of Beirut's campus. ",,"Phyllis Creighton Danby","Moise A. Khayrallah Center for Lebanese Diaspora Studies","circa 1928",,"The donor retains full ownership of any copyright and rights currently controlled. Nonexclusive right to authorize uses of these materials for non-commercial research, scholarly, or other educational purposes are granted to Khayrallah Center pursuant to U.S. Copyright Law. Usage of the materials for these purposes must be fully credited with the source. The user assumes full responsibility for any use of the materials.",,Image/jpg,,Image,kc0021_110,,,,,,,,,,,,,,,,,,,,,,,,,,,,,,,,,,,,,,,,,,,,,,,,,,,,,,,,,,,,,,,,,,,,,,,,,,,,,,"1920s,Beirut,Universities",https://lebanesestudies.omeka.chass.ncsu.edu/files/original/dc01c2600acbd9983589188bcfdcda0c.jpg,,"Creighton Family Papers",1,0
81921,https://lebanesestudies.omeka.chass.ncsu.edu/items/show/81921,,,,,,,,,,,,,,,,,,,,,,,,,,,,,,,,,,,,,,,,,"American University of Beirut Campus 2","Photographs^^ Lebanon","A photo of the full campus at the American University of Beirut.",,"Phyllis Creighton Danby","Moise A. Khayrallah Center for Lebanese Diaspora Studies","circa 1928",,"The donor retains full ownership of any copyright and rights currently controlled. Nonexclusive right to authorize uses of these materials for non-commercial research, scholarly, or other educational purposes are granted to Khayrallah Center pursuant to U.S. Copyright Law. Usage of the materials for these purposes must be fully credited with the source. The user assumes full responsibility for any use of the materials.",,Image/jpg,,Image,kc0021_109,,,,,,,,,,,,,,,,,,,,,,,,,,,,,,,,,,,,,,,,,,,,,,,,,,,,,,,,,,,,,,,,,,,,,,,,,,,,,,"1920s,Beirut,Landscapes,Universities",https://lebanesestudies.omeka.chass.ncsu.edu/files/original/eaeb57641a9231d737caa235768ac22a.jpg,,"Creighton Family Papers",1,0
81920,https://lebanesestudies.omeka.chass.ncsu.edu/items/show/81920,,,,,,,,,,,,,,,,,,,,,,,,,,,,,,,,,,,,,,,,,"American University of Beirut Campus 3","Photographs^^ Lebanon","A photo of a building on the campus of the American University of Beirut.",,"Phyllis Creighton Danby","Moise A. Khayrallah Center for Lebanese Diaspora Studies","circa 1928",,"The donor retains full ownership of any copyright and rights currently controlled. Nonexclusive right to authorize uses of these materials for non-commercial research, scholarly, or other educational purposes are granted to Khayrallah Center pursuant to U.S. Copyright Law. Usage of the materials for these purposes must be fully credited with the source. The user assumes full responsibility for any use of the materials.",,Image/jpg,,Image,kc0021_108,,,,,,,,,,,,,,,,,,,,,,,,,,,,,,,,,,,,,,,,,,,,,,,,,,,,,,,,,,,,,,,,,,,,,,,,,,,,,,"1920s,Beirut,Landscapes",https://lebanesestudies.omeka.chass.ncsu.edu/files/original/80937632841b9b33e353e02ef3ea0c1c.jpg,,"Creighton Family Papers",1,0
81915,https://lebanesestudies.omeka.chass.ncsu.edu/items/show/81915,,,,,,,,,,,,,,,,,,,,,,,,,,,,,,,,,,,,,,,,,"American University of Beirut Campus 4","Photographs^^ Lebanon","A photo of a building and surrounding landscape on the campus of the American University of Beirut.",,"Phyllis Creighton Danby","Moise A. Khayrallah Center for Lebanese Diaspora Studies","circa 1928",,"The donor retains full ownership of any copyright and rights currently controlled. Nonexclusive right to authorize uses of these materials for non-commercial research, scholarly, or other educational purposes are granted to Khayrallah Center pursuant to U.S. Copyright Law. Usage of the materials for these purposes must be fully credited with the source. The user assumes full responsibility for any use of the materials.",,Image/jpg,,Image,kc0021_103,,,,,,,,,,,,,,,,,,,,,,,,,,,,,,,,,,,,,,,,,,,,,,,,,,,,,,,,,,,,,,,,,,,,,,,,,,,,,,"1920s,Universities",https://lebanesestudies.omeka.chass.ncsu.edu/files/original/cd181a3f7414c3738f9f3523c42fa2c5.jpg,,"Creighton Family Papers",1,0
69136,https://lebanesestudies.omeka.chass.ncsu.edu/items/show/69136,,,,,,,,,,,,,,,,,,,,,,,,,,,,,,,,,,,,,,,,,"Article by Kail Ellis on Dr. Hadia Harb, undated","Photographs^^ Writing--History","An article written by Kail Ellis on Dr. Hadia Harb, the translator of many of the letters to Angele Ellis from the Ellis collection. Dr. Hadia Harb is pictured with Nasser Chour in Qattine, Lebanon, undated.","Kail Ellis","Kail Ellis","Moise A. Khayrallah Center for Lebanese Diaspora Studies","2000s c.",,"Donor retains full ownership of any and all copyright currently controlled in agreement with Khayrallah Center. Nonexclusive right to authorize all uses of these materials for non-commercial research, scholarly, or other educational purposes are granted to Khayrallah Center pursuant to Creative Commons Attribution-NonCommercial-ShareAlike (CC BY-NC-SA).",,Text/pdf,English,Text,KEllis2018-378,,,,,,,,,,,,,,,,,,,,,,,,,,,,,,,,,,,,,,,,,,,,,,,,,,,,,,,,,,,,,,,,,,,,,,,,,,,,,,"Chour,Ellis,Hadia Harb,Harb,Kail Ellis,Nasser Chour,Qattine, Lebanon",https://lebanesestudies.omeka.chass.ncsu.edu/files/original/ee2d725bfa2f221a5e9b5e13dc7d26f6.pdf,,"Angele Hobeiche Kmeid-Ellis Collection: Supplemental Materials",1,0
81841,https://lebanesestudies.omeka.chass.ncsu.edu/items/show/81841,,,,,,,,,,,,,,,,,,,,,,,,,,,,,,,,,,,,,,,,,"Assuan Reservoir Postcard","Photographs^^ ","A postcard depicting the ""Assuan Reservoir,"" now known as the Aswan Low Dam. ",,"Phyllis Creighton Danby","Moise A. Khayrallah Center for Lebanese Diaspora Studies","circa 1928",,"The donor retains full ownership of any copyright and rights currently controlled. Nonexclusive right to authorize uses of these materials for non-commercial research, scholarly, or other educational purposes are granted to Khayrallah Center pursuant to U.S. Copyright Law. Usage of the materials for these purposes must be fully credited with the source. The user assumes full responsibility for any use of the materials.",,Image/jpg,,Image,kc0021_028,,,,,,,,,,,,,,,,,,,,,,,,,,,,,,,,,,,,,,,,,,,,,,,,,,,,,,,,,,,,,,,,,,,,,,,,,,,,,,"1920s,Egypt,Postcards",https://lebanesestudies.omeka.chass.ncsu.edu/files/original/e2f978ae8b22e226902ae7f2b0269fd8.jpg,,"Creighton Family Papers",1,0
81814,https://lebanesestudies.omeka.chass.ncsu.edu/items/show/81814,,,,,,,,,,,,,,,,,,,,,,,,,,,,,,,,,,,,,,,,,"Athletic Fields at the American University of Beirut","Photographs^^ Lebanon","A photo of the oval track and athletic fields at American University of Beirut.",,"Phyllis Creighton Danby","Moise A. Khayrallah Center for Lebanese Diaspora Studies","circa 1928",,"The donor retains full ownership of any copyright and rights currently controlled. Nonexclusive right to authorize uses of these materials for non-commercial research, scholarly, or other educational purposes are granted to Khayrallah Center pursuant to U.S. Copyright Law. Usage of the materials for these purposes must be fully credited with the source. The user assumes full responsibility for any use of the materials.",,Image/jpg,,Image,kc0021_001,,,,,,,,,,,,,,,,,,,,,,,,,,,,,,,,,,,,,,,,,,,,,,,,,,,,,,,,,,,,,,,,,,,,,,,,,,,,,,"1920s,Landscapes,Lebanon,Universities",https://lebanesestudies.omeka.chass.ncsu.edu/files/original/014720351fc197895a552801021d767f.jpg,,"Creighton Family Papers",1,0
81840,https://lebanesestudies.omeka.chass.ncsu.edu/items/show/81840,,,,,,,,,,,,,,,,,,,,,,,,,,,,,,,,,,,,,,,,,"Basilique de l'Ecce Homo Postcard","Photographs^^ ","A postcard depicting the Ecce Homo Basilica in Jerusalem. ",,"Phyllis Creighton Danby","Moise A. Khayrallah Center for Lebanese Diaspora Studies","circa 1928",,"The donor retains full ownership of any copyright and rights currently controlled. Nonexclusive right to authorize uses of these materials for non-commercial research, scholarly, or other educational purposes are granted to Khayrallah Center pursuant to U.S. Copyright Law. Usage of the materials for these purposes must be fully credited with the source. The user assumes full responsibility for any use of the materials.",,Image/jpg,,Image,kc0021_027,,,,,,,,,,,,,,,,,,,,,,,,,,,,,,,,,,,,,,,,,,,,,,,,,,,,,,,,,,,,,,,,,,,,,,,,,,,,,,"1920s,Jerusalem",https://lebanesestudies.omeka.chass.ncsu.edu/files/original/b9f27bec4a32c235ab51ca093a5fa345.jpg,,"Creighton Family Papers",1,0
79470,https://lebanesestudies.omeka.chass.ncsu.edu/items/show/79470,,,,,,,,,,,,,,,,,,,,,,,,,,,,,,,,,,,,,,,,,"Bearta Al-Chacar's First Day in the Orphanage",Photographs,"A photograph of Bearta Al-Chacar Powell and siblings on their first day in the Children's Village S.O.S orphanage in Bikfaya, Lebanon.",,"Bearta Al-Chacar Powell","Moise A. Khayrallah Center for Lebanese Diaspora Studies",1971,,"The donor retains full ownership of any copyright and rights currently controlled. Nonexclusive right to authorize uses of these materials for non-commercial research, scholarly, or other educational purposes are granted to Khayrallah Center pursuant to U.S. Copyright Law. Usage of the materials for these purposes must be fully credited with the source. The user assumes full responsibility for any use of the materials.",,Image/pdf,,Image,kc0038_002,,,,,,,,,,,,,,,,,,,,,,,,,,,,,,,,,,,,,,,,,,,,,,,,,,,,,,,,,,,,,,,,,,,,,,,,,,,,,,"1970s,Families,Lebanon",https://lebanesestudies.omeka.chass.ncsu.edu/files/original/dfbb1f1e7747af7a7bda711af1a37287.pdf,,"Bearta Al-Chacar Powell Photographs",1,0
79467,https://lebanesestudies.omeka.chass.ncsu.edu/items/show/79467,,,,,,,,,,,,,,,,,,,,,,,,,,,,,,,,,,,,,,,,,"Bearta Al-Chacar's Parents on their Wedding Day",Photographs,"A photograph of Ramiz Al-Shakar and Isabelle Maalouf, the parents of Bearta Al-Chacar Powell, on their wedding day.",,"Bearta Al-Chacar Powell","Moise A. Khayrallah Center for Lebanese Diaspora Studies",undated,,"The donor retains full ownership of any copyright and rights currently controlled. Nonexclusive right to authorize uses of these materials for non-commercial research, scholarly, or other educational purposes are granted to Khayrallah Center pursuant to U.S. Copyright Law. Usage of the materials for these purposes must be fully credited with the source. The user assumes full responsibility for any use of the materials.",,Image/pdf,,Image,kc0038_005,,,,,,,,,,,,,,,,,,,,,,,,,,,,,,,,,,,,,,,,,,,,,,,,,,,,,,,,,,,,,,,,,,,,,,,,,,,,,,"1950s,Weddings",https://lebanesestudies.omeka.chass.ncsu.edu/files/original/10eb9ce178f6a66ecc5163f9fa44bfdd.pdf,,"Bearta Al-Chacar Powell Photographs",1,0
79211,https://lebanesestudies.omeka.chass.ncsu.edu/items/show/79211,,,,,,,,,,,,,,,,,,,,,,,,,,,,,,,,,,,,,,,,,"Beshara and Serina Hakeem ","Photographs^^ Lebanese--United States","A photograph of Beshara and Serina Shehdan. Though undated, this photograph was likely taken in the 1970s.",,"Philip Shehdan","Moise A. Khayrallah Center for Lebanese Diaspora Studies","circa 1970s",,"The donor retains full ownership of any copyright and rights currently controlled. Nonexclusive right to authorize uses of these materials for non-commercial research, scholarly, or other educational purposes are granted to Khayrallah Center pursuant to U.S. Copyright Law. Usage of the materials for these purposes must be fully credited with the source. The user assumes full responsibility for any use of the materials.",,Image/pdf,,Image,kc0033_018,,,,,,,,,,,,,,,,,,,,,,,,,,,,,,,,,,,,,,,,,,,,,,,,,,,,,,,,,,,,,,,,,,,,,,,,,,,,,,1970s,https://lebanesestudies.omeka.chass.ncsu.edu/files/original/15f127236f266bf475b050a35c693933.pdf,,"Shehdan Family Collection",1,0