﻿"Item Id","Item URI","Dublin Core:Alternative Title","Dublin Core:Abstract","Dublin Core:Table Of Contents","Dublin Core:Date Available","Dublin Core:Date Created","Dublin Core:Date Accepted","Dublin Core:Date Copyrighted","Dublin Core:Date Submitted","Dublin Core:Date Issued","Dublin Core:Date Modified","Dublin Core:Date Valid","Dublin Core:Access Rights","Dublin Core:License","Dublin Core:Conforms To","Dublin Core:Has Format","Dublin Core:Has Part","Dublin Core:Has Version","Dublin Core:Is Format Of","Dublin Core:Is Part Of","Dublin Core:Is Referenced By","Dublin Core:Is Replaced By","Dublin Core:Is Required By","Dublin Core:Is Version Of","Dublin Core:References","Dublin Core:Replaces","Dublin Core:Requires","Dublin Core:Extent","Dublin Core:Medium","Dublin Core:Bibliographic Citation","Dublin Core:Spatial Coverage","Dublin Core:Temporal Coverage","Dublin Core:Accrual Method","Dublin Core:Accrual Periodicity","Dublin Core:Accrual Policy","Dublin Core:Audience","Dublin Core:Audience Education Level","Dublin Core:Mediator","Dublin Core:Instructional Method","Dublin Core:Provenance","Dublin Core:Rights Holder","Dublin Core:Title","Dublin Core:Subject","Dublin Core:Description","Dublin Core:Creator","Dublin Core:Source","Dublin Core:Publisher","Dublin Core:Date","Dublin Core:Contributor","Dublin Core:Rights","Dublin Core:Relation","Dublin Core:Format","Dublin Core:Language","Dublin Core:Type","Dublin Core:Identifier","Dublin Core:Coverage","Item Type Metadata:Text","Item Type Metadata:Interviewer","Item Type Metadata:Interviewee","Item Type Metadata:Location","Item Type Metadata:Transcription","Item Type Metadata:Local URL","Item Type Metadata:Original Format","Item Type Metadata:Physical Dimensions","Item Type Metadata:Duration","Item Type Metadata:Compression","Item Type Metadata:Producer","Item Type Metadata:Director","Item Type Metadata:Bit Rate/Frequency","Item Type Metadata:Time Summary","Item Type Metadata:Email Body","Item Type Metadata:Subject Line","Item Type Metadata:From","Item Type Metadata:To","Item Type Metadata:CC","Item Type Metadata:BCC","Item Type Metadata:Number of Attachments","Item Type Metadata:Standards","Item Type Metadata:Objectives","Item Type Metadata:Materials","Item Type Metadata:Lesson Plan Text","Item Type Metadata:URL","Item Type Metadata:Event Type","Item Type Metadata:Participants","Item Type Metadata:Birth Date","Item Type Metadata:Birthplace","Item Type Metadata:Death Date","Item Type Metadata:Occupation","Item Type Metadata:Biographical Text","Item Type Metadata:Bibliography","Item Type Metadata:First Name (English)","Item Type Metadata:Last Name (English)","Item Type Metadata:Address","Item Type Metadata:City","Item Type Metadata:State","Item Type Metadata:Business (English)","Item Type Metadata:Provenance (English)","Item Type Metadata:Provenance (Arabic)","Item Type Metadata:Business (Arabic)","Item Type Metadata:Last Name (Arabic)","Item Type Metadata:First Name (Arabic)","Item Type Metadata:Player","Omeka Legacy File:Additional Creator","Omeka Legacy File:Transcriber","Omeka Legacy File:Producer","Omeka Legacy File:Render Device","Omeka Legacy File:Render Details","Omeka Legacy File:Capture Date","Omeka Legacy File:Capture Device","Omeka Legacy File:Capture Details","Omeka Legacy File:Change History","Omeka Legacy File:Watermark","Omeka Legacy File:Encryption","Omeka Legacy File:Compression","Omeka Legacy File:Post Processing","Omeka Image File:Width","Omeka Image File:Height","Omeka Image File:Bit Depth","Omeka Image File:Channels","Omeka Image File:Exif String","Omeka Image File:Exif Array","Omeka Image File:IPTC String","Omeka Image File:IPTC Array","Omeka Video File:Bitrate","Omeka Video File:Duration","Omeka Video File:Sample Rate","Omeka Video File:Codec","Omeka Video File:Width","Omeka Video File:Height","PDF Text:Text","Users Elements:Test","Test Elements:Test",tags,file,itemType,collection,public,featured
81956,https://lebanesestudies.omeka.chass.ncsu.edu/items/show/81956,,,,,,,,,,,,,,,,,,,,,,,,,,,,,,,,,,,,,,,,,"Various Negatives from 1930's",,"A photographic negatives of various children taken during the 1930s that were found in Neville Fuleihan's baby booklet. ",,"Oussani Fuleihan family","Moise A. Khayrallah Center for Lebanese Diaspora Studies",1930s,,"The donor retains full ownership of any copyright and rights currently controlled. Nonexclusive right to authorize uses of these materials for non-commercial research, scholarly, or other educational purposes are granted to Khayrallah Center pursuant to U.S. Copyright Law. Usage of the materials for these purposes must be fully credited with the source. The user assumes full responsibility for any use of the materials.",,Image/pdf,,Image,Oussani2018-1183,,,,,,,,,,,,,,,,,,,,,,,,,,,,,,,,,,,,,,,,,,,,,,,,,,,,,,,,,,,,,,,,,,,,,,,,,,,,,,1930s,https://lebanesestudies.omeka.chass.ncsu.edu/files/original/484c6356e5e2826da8d3779c8165fcda.pdf,,"Oussani and Fuleihan Family Papers Series 2: Photographs",1,0
81957,https://lebanesestudies.omeka.chass.ncsu.edu/items/show/81957,,,,,,,,,,,,,,,,,,,,,,,,,,,,,,,,,,,,,,,,,"""Neville S. Fuleihan Stationed in Texas"" Article",Newspapers,"Newspaper clipping describing Neville Fuleihan, son of Mr. and Mrs. Nasri Fuleihan of Meadow Ave., one of 22 airmen recently graduated from ambulance driver class at Lackland Air Force Base, San Antonio, Texas.",,"Oussani Fuleihan family","Moise A. Khayrallah Center for Lebanese Diaspora Studies",1940s,,"The donor retains full ownership of any copyright and rights currently controlled. Nonexclusive right to authorize uses of these materials for non-commercial research, scholarly, or other educational purposes are granted to Khayrallah Center pursuant to U.S. Copyright Law. Usage of the materials for these purposes must be fully credited with the source. The user assumes full responsibility for any use of the materials.",,Text/pdf,English,Text,Oussani2018-1180a,,,,,,,,,,,,,,,,,,,,,,,,,,,,,,,,,,,,,,,,,,,,,,,,,,,,,,,,,,,,,,,,,,,,,,,,,,,,,,"1940s,Military,Newspapers,Texas",https://lebanesestudies.omeka.chass.ncsu.edu/files/original/5338b99f992ed9da429bf21d1c34aacb.pdf,,"Oussani and Fuleihan Family Papers Series 1: Documents",1,0
81958,https://lebanesestudies.omeka.chass.ncsu.edu/items/show/81958,,,,,,,,,,,,,,,,,,,,,,,,,,,,,,,,,,,,,,,,,"Mr. and Mrs. Fuleihan Name Card",,"Name card with Mr. and Mrs. N. Fuleihan written on it.",,"Oussani Fuleihan family","Moise A. Khayrallah Center for Lebanese Diaspora Studies",undated,,"The donor retains full ownership of any copyright and rights currently controlled. Nonexclusive right to authorize uses of these materials for non-commercial research, scholarly, or other educational purposes are granted to Khayrallah Center pursuant to U.S. Copyright Law. Usage of the materials for these purposes must be fully credited with the source. The user assumes full responsibility for any use of the materials.",,Text/pdf,English,Text,Oussani2018-1177,,,,,,,,,,,,,,,,,,,,,,,,,,,,,,,,,,,,,,,,,,,,,,,,,,,,,,,,,,,,,,,,,,,,,,,,,,,,,,,https://lebanesestudies.omeka.chass.ncsu.edu/files/original/400ebafeeca922b09b3869bfe4701bff.pdf,,"Oussani and Fuleihan Family Papers Series 1: Documents",1,0
81959,https://lebanesestudies.omeka.chass.ncsu.edu/items/show/81959,,,,,,,,,,,,,,,,,,,,,,,,,,,,,,,,,,,,,,,,,"Nasri Fuleihan Business Card",,"A business card for N. S. Fuleihan and Company, Manufacturers Representatives and Distributors at 14 Chareh Maghrabi in Cairo, Egypt.","N. S. Fuleihan and Company","Oussani Fuleihan family","Moise A. Khayrallah Center for Lebanese Diaspora Studies",undated,,"The donor retains full ownership of any copyright and rights currently controlled. Nonexclusive right to authorize uses of these materials for non-commercial research, scholarly, or other educational purposes are granted to Khayrallah Center pursuant to U.S. Copyright Law. Usage of the materials for these purposes must be fully credited with the source. The user assumes full responsibility for any use of the materials.",,Image/pdf,English,Text,Oussani2018-1176,,,,,,,,,,,,,,,,,,,,,,,,,,,,,,,,,,,,,,,,,,,,,,,,,,,,,,,,,,,,,,,,,,,,,,,,,,,,,,"Business Cards,Egypt",https://lebanesestudies.omeka.chass.ncsu.edu/files/original/245504c2c7d7f1ea8f8d339981629cff.pdf,,"Oussani and Fuleihan Family Papers Series 1: Documents",1,0
81960,https://lebanesestudies.omeka.chass.ncsu.edu/items/show/81960,,,,,,,,,,,,,,,,,,,,,,,,,,,,,,,,,,,,,,,,,"Gabriel Oussani Business Card",,"Rev. Gabriel Oussani's business card, listing his name and place of work, St. Joseph's Seminary, Dunwoodie, Yonkers, NY.","Gabriel Oussani","Oussani Fuleihan family","Moise A. Khayrallah Center for Lebanese Diaspora Studies",undated,,"The donor retains full ownership of any copyright and rights currently controlled. Nonexclusive right to authorize uses of these materials for non-commercial research, scholarly, or other educational purposes are granted to Khayrallah Center pursuant to U.S. Copyright Law. Usage of the materials for these purposes must be fully credited with the source. The user assumes full responsibility for any use of the materials.",,Text/pdf,English,Text,Oussani2018-1175,,,,,,,,,,,,,,,,,,,,,,,,,,,,,,,,,,,,,,,,,,,,,,,,,,,,,,,,,,,,,,,,,,,,,,,,,,,,,,"Business Cards,Catholic Church,New York",https://lebanesestudies.omeka.chass.ncsu.edu/files/original/cc5b26792e032d4a571cc0ac0a7cc381.pdf,,"Oussani and Fuleihan Family Papers Series 1: Documents",1,0
81961,https://lebanesestudies.omeka.chass.ncsu.edu/items/show/81961,,,,,,,,,,,,,,,,,,,,,,,,,,,,,,,,,,,,,,,,,"""Old Friends"" Poem",,"A document with a poem titled ""Old Friends.""",,"Oussani Fuleihan family","Moise A. Khayrallah Center for Lebanese Diaspora Studies",undated,,"The donor retains full ownership of any copyright and rights currently controlled. Nonexclusive right to authorize uses of these materials for non-commercial research, scholarly, or other educational purposes are granted to Khayrallah Center pursuant to U.S. Copyright Law. Usage of the materials for these purposes must be fully credited with the source. The user assumes full responsibility for any use of the materials.",,Text/pdf,English,Text,Oussani2018-1174,,,,,,,,,,,,,,,,,,,,,,,,,,,,,,,,,,,,,,,,,,,,,,,,,,,,,,,,,,,,,,,,,,,,,,,,,,,,,,Poetry-English,https://lebanesestudies.omeka.chass.ncsu.edu/files/original/aa6105714d5b2598e16e614d935cfd79.pdf,,"Oussani and Fuleihan Family Papers Series 1: Documents",1,0
81962,https://lebanesestudies.omeka.chass.ncsu.edu/items/show/81962,,,,,,,,,,,,,,,,,,,,,,,,,,,,,,,,,,,,,,,,,"Anis Fuleihan Program",Music,"A copy of a program, published by Southern Music Publishing Company describing Fuleihan's work. One page also includes newspaper clippings about Anis and his work.","Southern Music Publishing Company","Oussani Fuleihan family","Moise A. Khayrallah Center for Lebanese Diaspora Studies",undated,,"The donor retains full ownership of any copyright and rights currently controlled. Nonexclusive right to authorize uses of these materials for non-commercial research, scholarly, or other educational purposes are granted to Khayrallah Center pursuant to U.S. Copyright Law. Usage of the materials for these purposes must be fully credited with the source. The user assumes full responsibility for any use of the materials.",,Image/pdf,English,Text,Oussani2018-1173,,,,,,,,,,,,,,,,,,,,,,,,,,,,,,,,,,,,,,,,,,,,,,,,,,,,,,,,,,,,,,,,,,,,,,,,,,,,,,"Music,New York,Newspapers,Programs",https://lebanesestudies.omeka.chass.ncsu.edu/files/original/a5251c0bcbb5c9e4e5c7cd15632befc4.pdf,,"Oussani and Fuleihan Family Papers Series 1: Documents",1,0
81963,https://lebanesestudies.omeka.chass.ncsu.edu/items/show/81963,,,,,,,,,,,,,,,,,,,,,,,,,,,,,,,,,,,,,,,,,"Letter from Dorothy O'Keefe to Mr. Claus-Christian Schuster",Music,"A letter written by Anis's niece, Dorothy Fuleihan O'Keefe, regarding a search for one of his pieces of music.","Dorothy Fuleihan","Oussani Fuleihan family","Moise A. Khayrallah Center for Lebanese Diaspora Studies",undated,,"The donor retains full ownership of any copyright and rights currently controlled. Nonexclusive right to authorize uses of these materials for non-commercial research, scholarly, or other educational purposes are granted to Khayrallah Center pursuant to U.S. Copyright Law. Usage of the materials for these purposes must be fully credited with the source. The user assumes full responsibility for any use of the materials.",,Text/pdf,English,Text,Oussani2018-1172a,,,,,,,,,,,,,,,,,,,,,,,,,,,,,,,,,,,,,,,,,,,,,,,,,,,,,,,,,,,,,,,,,,,,,,,,,,,,,,"Letters-English,Music",https://lebanesestudies.omeka.chass.ncsu.edu/files/original/d081c0dd9a5957564895af2a64c063c1.pdf,,"Oussani and Fuleihan Family Papers Series 1: Documents",1,0
81964,https://lebanesestudies.omeka.chass.ncsu.edu/items/show/81964,,,,,,,,,,,,,,,,,,,,,,,,,,,,,,,,,,,,,,,,,"Anis Fuleihan Program",Music,"A program, published by Southern Music Publishing Company, describing Fuleihan's work.","Southern Music Publishing Company","Oussani Fuleihan family","Moise A. Khayrallah Center for Lebanese Diaspora Studies",undated,,"The donor retains full ownership of any copyright and rights currently controlled. Nonexclusive right to authorize uses of these materials for non-commercial research, scholarly, or other educational purposes are granted to Khayrallah Center pursuant to U.S. Copyright Law. Usage of the materials for these purposes must be fully credited with the source. The user assumes full responsibility for any use of the materials.",,Image/pdf,English,Text,Oussani2018-1171,,,,,,,,,,,,,,,,,,,,,,,,,,,,,,,,,,,,,,,,,,,,,,,,,,,,,,,,,,,,,,,,,,,,,,,,,,,,,,"Music,New York,Programs",https://lebanesestudies.omeka.chass.ncsu.edu/files/original/70d59b18edd512e5c5af2c41f6040f8c.pdf,,"Oussani and Fuleihan Family Papers Series 1: Documents",1,0
81965,https://lebanesestudies.omeka.chass.ncsu.edu/items/show/81965,,,,,,,,,,,,,,,,,,,,,,,,,,,,,,,,,,,,,,,,,"Arabic Newspaper Clipping",Newspapers,"Document written in Arabic.",,"Oussani Fuleihan family","Moise A. Khayrallah Center for Lebanese Diaspora Studies",undated,,"The donor retains full ownership of any copyright and rights currently controlled. Nonexclusive right to authorize uses of these materials for non-commercial research, scholarly, or other educational purposes are granted to Khayrallah Center pursuant to U.S. Copyright Law. Usage of the materials for these purposes must be fully credited with the source. The user assumes full responsibility for any use of the materials.",,Text/pdf,Arabic,Text,Oussani2018-1170,,,,,,,,,,,,,,,,,,,,,,,,,,,,,,,,,,,,,,,,,,,,,,,,,,,,,,,,,,,,,,,,,,,,,,,,,,,,,,Records,https://lebanesestudies.omeka.chass.ncsu.edu/files/original/63630563d62e2bc2f6b8240a5cb03638.pdf,,"Oussani and Fuleihan Family Papers Series 1: Documents",1,0
81966,https://lebanesestudies.omeka.chass.ncsu.edu/items/show/81966,,,,,,,,,,,,,,,,,,,,,,,,,,,,,,,,,,,,,,,,,"Arabic Letter",Correspondence,"A letter written in Arabic.",,"Oussani Fuleihan family","Moise A. Khayrallah Center for Lebanese Diaspora Studies",undated,,"The donor retains full ownership of any copyright and rights currently controlled. Nonexclusive right to authorize uses of these materials for non-commercial research, scholarly, or other educational purposes are granted to Khayrallah Center pursuant to U.S. Copyright Law. Usage of the materials for these purposes must be fully credited with the source. The user assumes full responsibility for any use of the materials.",,Text/pdf,Arabic,Text,Oussani2018-1169,,,,,,,,,,,,,,,,,,,,,,,,,,,,,,,,,,,,,,,,,,,,,,,,,,,,,,,,,,,,,,,,,,,,,,,,,,,,,,Letters-Arabic,https://lebanesestudies.omeka.chass.ncsu.edu/files/original/71eb0beadadc29b5f1ebf31224820ee5.pdf,,"Oussani and Fuleihan Family Papers Series 1: Documents",1,0
81967,https://lebanesestudies.omeka.chass.ncsu.edu/items/show/81967,,,,,,,,,,,,,,,,,,,,,,,,,,,,,,,,,,,,,,,,,"Deed Envelope for Joseph Oussani",Cemeteries,"An envelope marked ""Deed"" addressed to Joseph Oussani, produced by Charles Traynor, Funeral Director.","Charles Traynor, Funeral Director","Oussani Fuleihan family","Moise A. Khayrallah Center for Lebanese Diaspora Studies",undated,,"The donor retains full ownership of any copyright and rights currently controlled. Nonexclusive right to authorize uses of these materials for non-commercial research, scholarly, or other educational purposes are granted to Khayrallah Center pursuant to U.S. Copyright Law. Usage of the materials for these purposes must be fully credited with the source. The user assumes full responsibility for any use of the materials.",,Text/pdf,English,Text,Oussani2018-1167,,,,,,,,,,,,,,,,,,,,,,,,,,,,,,,,,,,,,,,,,,,,,,,,,,,,,,,,,,,,,,,,,,,,,,,,,,,,,,"Cemeteries,Envelopes",https://lebanesestudies.omeka.chass.ncsu.edu/files/original/056d4f6234a2930da2b41869b4ea6009.pdf,,"Oussani and Fuleihan Family Papers Series 1: Documents",1,0
81968,https://lebanesestudies.omeka.chass.ncsu.edu/items/show/81968,,,,,,,,,,,,,,,,,,,,,,,,,,,,,,,,,,,,,,,,,"Oussani Vault Notes",Cemeteries,"A note listing the order of graves to occupy the Oussani family vault.",,"Oussani Fuleihan family","Moise A. Khayrallah Center for Lebanese Diaspora Studies",undated,,"The donor retains full ownership of any copyright and rights currently controlled. Nonexclusive right to authorize uses of these materials for non-commercial research, scholarly, or other educational purposes are granted to Khayrallah Center pursuant to U.S. Copyright Law. Usage of the materials for these purposes must be fully credited with the source. The user assumes full responsibility for any use of the materials.",,Text/pdf,English,Text,Oussani2018-1166,,,,,,,,,,,,,,,,,,,,,,,,,,,,,,,,,,,,,,,,,,,,,,,,,,,,,,,,,,,,,,,,,,,,,,,,,,,,,,Cemeteries,https://lebanesestudies.omeka.chass.ncsu.edu/files/original/e970a2d1fea72bd3db5d223e43f0ef21.pdf,,"Oussani and Fuleihan Family Papers Series 1: Documents",1,0
81969,https://lebanesestudies.omeka.chass.ncsu.edu/items/show/81969,,,,,,,,,,,,,,,,,,,,,,,,,,,,,,,,,,,,,,,,,"Cemetery Deed Envelope",Cemeteries,"An envelope marked ""Cemetery Deed"" with names ""Shea, Lynch and Harrington"" produced by Joseph Kennedy Funeral Chapel, Inc.","Joseph T. Kennedy Funeral Chapel","Oussani Fuleihan family","Moise A. Khayrallah Center for Lebanese Diaspora Studies",undated,,"The donor retains full ownership of any copyright and rights currently controlled. Nonexclusive right to authorize uses of these materials for non-commercial research, scholarly, or other educational purposes are granted to Khayrallah Center pursuant to U.S. Copyright Law. Usage of the materials for these purposes must be fully credited with the source. The user assumes full responsibility for any use of the materials.",,Text/pdf,English,Text,Oussani2018-1165,,,,,,,,,,,,,,,,,,,,,,,,,,,,,,,,,,,,,,,,,,,,,,,,,,,,,,,,,,,,,,,,,,,,,,,,,,,,,,"Cemeteries,Envelopes",https://lebanesestudies.omeka.chass.ncsu.edu/files/original/ff480610512f04df79df5b3ca08f6f44.pdf,,"Oussani and Fuleihan Family Papers Series 1: Documents",1,0
81970,https://lebanesestudies.omeka.chass.ncsu.edu/items/show/81970,,,,,,,,,,,,,,,,,,,,,,,,,,,,,,,,,,,,,,,,,"Envelope Marked "" All Calvary""",Cemeteries,"An envelope, marked ""All Calvary,"" holding documents related to Calvary Cemetery.",,"Oussani Fuleihan family","Moise A. Khayrallah Center for Lebanese Diaspora Studies",undated,,"The donor retains full ownership of any copyright and rights currently controlled. Nonexclusive right to authorize uses of these materials for non-commercial research, scholarly, or other educational purposes are granted to Khayrallah Center pursuant to U.S. Copyright Law. Usage of the materials for these purposes must be fully credited with the source. The user assumes full responsibility for any use of the materials.",,Text/pdf,English,Text,Oussani2018-1164,,,,,,,,,,,,,,,,,,,,,,,,,,,,,,,,,,,,,,,,,,,,,,,,,,,,,,,,,,,,,,,,,,,,,,,,,,,,,,"Cemeteries,Envelopes,Records",https://lebanesestudies.omeka.chass.ncsu.edu/files/original/e0a37ef45bf41e495b434f3611e7a322.pdf,,"Oussani and Fuleihan Family Papers Series 1: Documents",1,0
81971,https://lebanesestudies.omeka.chass.ncsu.edu/items/show/81971,,,,,,,,,,,,,,,,,,,,,,,,,,,,,,,,,,,,,,,,,"J. McKenna Business Card",Cemeteries,"A business card for J. McKenna, who erects monuments and mausoleums. Written on back is plot information.","J. McKenna","Oussani Fuleihan family","Moise A. Khayrallah Center for Lebanese Diaspora Studies",undated,,"The donor retains full ownership of any copyright and rights currently controlled. Nonexclusive right to authorize uses of these materials for non-commercial research, scholarly, or other educational purposes are granted to Khayrallah Center pursuant to U.S. Copyright Law. Usage of the materials for these purposes must be fully credited with the source. The user assumes full responsibility for any use of the materials.",,Text/pdf,English,Text,Oussani2018-1163,,,,,,,,,,,,,,,,,,,,,,,,,,,,,,,,,,,,,,,,,,,,,,,,,,,,,,,,,,,,,,,,,,,,,,,,,,,,,,"Business Cards,Cemeteries",https://lebanesestudies.omeka.chass.ncsu.edu/files/original/bd509f7a0f9b504b6f70e4c6ad265b5c.pdf,,"Oussani and Fuleihan Family Papers Series 1: Documents",1,0
81972,https://lebanesestudies.omeka.chass.ncsu.edu/items/show/81972,,,,,,,,,,,,,,,,,,,,,,,,,,,,,,,,,,,,,,,,,"Receipt for Cemetery Payment",Cemeteries,"A receipt for perpetual care payment at Calvary Cemetery, ""monumental regulations"" listed on back. In name of Josephine G. Harrington.","St. Patrick's Cathedral","Oussani Fuleihan family","Moise A. Khayrallah Center for Lebanese Diaspora Studies",undated,,"The donor retains full ownership of any copyright and rights currently controlled. Nonexclusive right to authorize uses of these materials for non-commercial research, scholarly, or other educational purposes are granted to Khayrallah Center pursuant to U.S. Copyright Law. Usage of the materials for these purposes must be fully credited with the source. The user assumes full responsibility for any use of the materials.",,Text/pdf,English,Text,Oussani2018-1162,,,,,,,,,,,,,,,,,,,,,,,,,,,,,,,,,,,,,,,,,,,,,,,,,,,,,,,,,,,,,,,,,,,,,,,,,,,,,,"Cemeteries,New York",https://lebanesestudies.omeka.chass.ncsu.edu/files/original/2bbab9e29e9f6db5cda67920e36302cb.pdf,,"Oussani and Fuleihan Family Papers Series 1: Documents",1,0
81973,https://lebanesestudies.omeka.chass.ncsu.edu/items/show/81973,,,,,,,,,,,,,,,,,,,,,,,,,,,,,,,,,,,,,,,,,Directions,Correspondence,"Directions for ""return via T.B."" written on a small piece of paper.",,"Oussani Fuleihan family","Moise A. Khayrallah Center for Lebanese Diaspora Studies",undated,,"The donor retains full ownership of any copyright and rights currently controlled. Nonexclusive right to authorize uses of these materials for non-commercial research, scholarly, or other educational purposes are granted to Khayrallah Center pursuant to U.S. Copyright Law. Usage of the materials for these purposes must be fully credited with the source. The user assumes full responsibility for any use of the materials.",,Text/pdf,English,Text,Oussani2018-1161,,,,,,,,,,,,,,,,,,,,,,,,,,,,,,,,,,,,,,,,,,,,,,,,,,,,,,,,,,,,,,,,,,,,,,,,,,,,,,,https://lebanesestudies.omeka.chass.ncsu.edu/files/original/6331780e3eefc84873e47db34db451ee.pdf,,"Oussani and Fuleihan Family Papers Series 1: Documents",1,0