﻿"Item Id","Item URI","Dublin Core:Alternative Title","Dublin Core:Abstract","Dublin Core:Table Of Contents","Dublin Core:Date Available","Dublin Core:Date Created","Dublin Core:Date Accepted","Dublin Core:Date Copyrighted","Dublin Core:Date Submitted","Dublin Core:Date Issued","Dublin Core:Date Modified","Dublin Core:Date Valid","Dublin Core:Access Rights","Dublin Core:License","Dublin Core:Conforms To","Dublin Core:Has Format","Dublin Core:Has Part","Dublin Core:Has Version","Dublin Core:Is Format Of","Dublin Core:Is Part Of","Dublin Core:Is Referenced By","Dublin Core:Is Replaced By","Dublin Core:Is Required By","Dublin Core:Is Version Of","Dublin Core:References","Dublin Core:Replaces","Dublin Core:Requires","Dublin Core:Extent","Dublin Core:Medium","Dublin Core:Bibliographic Citation","Dublin Core:Spatial Coverage","Dublin Core:Temporal Coverage","Dublin Core:Accrual Method","Dublin Core:Accrual Periodicity","Dublin Core:Accrual Policy","Dublin Core:Audience","Dublin Core:Audience Education Level","Dublin Core:Mediator","Dublin Core:Instructional Method","Dublin Core:Provenance","Dublin Core:Rights Holder","Dublin Core:Title","Dublin Core:Subject","Dublin Core:Description","Dublin Core:Creator","Dublin Core:Source","Dublin Core:Publisher","Dublin Core:Date","Dublin Core:Contributor","Dublin Core:Rights","Dublin Core:Relation","Dublin Core:Format","Dublin Core:Language","Dublin Core:Type","Dublin Core:Identifier","Dublin Core:Coverage","Item Type Metadata:Text","Item Type Metadata:Interviewer","Item Type Metadata:Interviewee","Item Type Metadata:Location","Item Type Metadata:Transcription","Item Type Metadata:Local URL","Item Type Metadata:Original Format","Item Type Metadata:Physical Dimensions","Item Type Metadata:Duration","Item Type Metadata:Compression","Item Type Metadata:Producer","Item Type Metadata:Director","Item Type Metadata:Bit Rate/Frequency","Item Type Metadata:Time Summary","Item Type Metadata:Email Body","Item Type Metadata:Subject Line","Item Type Metadata:From","Item Type Metadata:To","Item Type Metadata:CC","Item Type Metadata:BCC","Item Type Metadata:Number of Attachments","Item Type Metadata:Standards","Item Type Metadata:Objectives","Item Type Metadata:Materials","Item Type Metadata:Lesson Plan Text","Item Type Metadata:URL","Item Type Metadata:Event Type","Item Type Metadata:Participants","Item Type Metadata:Birth Date","Item Type Metadata:Birthplace","Item Type Metadata:Death Date","Item Type Metadata:Occupation","Item Type Metadata:Biographical Text","Item Type Metadata:Bibliography","Item Type Metadata:First Name (English)","Item Type Metadata:Last Name (English)","Item Type Metadata:Address","Item Type Metadata:City","Item Type Metadata:State","Item Type Metadata:Business (English)","Item Type Metadata:Provenance (English)","Item Type Metadata:Provenance (Arabic)","Item Type Metadata:Business (Arabic)","Item Type Metadata:Last Name (Arabic)","Item Type Metadata:First Name (Arabic)","Item Type Metadata:Player","Omeka Legacy File:Additional Creator","Omeka Legacy File:Transcriber","Omeka Legacy File:Producer","Omeka Legacy File:Render Device","Omeka Legacy File:Render Details","Omeka Legacy File:Capture Date","Omeka Legacy File:Capture Device","Omeka Legacy File:Capture Details","Omeka Legacy File:Change History","Omeka Legacy File:Watermark","Omeka Legacy File:Encryption","Omeka Legacy File:Compression","Omeka Legacy File:Post Processing","Omeka Image File:Width","Omeka Image File:Height","Omeka Image File:Bit Depth","Omeka Image File:Channels","Omeka Image File:Exif String","Omeka Image File:Exif Array","Omeka Image File:IPTC String","Omeka Image File:IPTC Array","Omeka Video File:Bitrate","Omeka Video File:Duration","Omeka Video File:Sample Rate","Omeka Video File:Codec","Omeka Video File:Width","Omeka Video File:Height","PDF Text:Text","Users Elements:Test","Test Elements:Test",tags,file,itemType,collection,public,featured
81089,https://lebanesestudies.omeka.chass.ncsu.edu/items/show/81089,,,,,,,,,,,,,,,,,,,,,,,,,,,,,,,,,,,,,,,,,"Postcard of Westminster Abbey to Sam Norman","Lebanese Americans","Postcard featuring a photograph of Westminster Abbey with Big Ben and St. Margaret's Church sent to Sam Norman in Poughkeepsie from his niece or nephew.",,"Genevieve Rose Joseph","Moise A. Khayrallah Center for Lebanese Diaspora Studies","1960 Sep 2",,"The donor retains full ownership of any copyright and rights currently controlled. Nonexclusive right to authorize uses of these materials for non-commercial research, scholarly, or other educational purposes are granted to Khayrallah Center pursuant to U.S. Copyright Law. Usage of the materials for these purposes must be fully credited with the source. The user assumes full responsibility for any use of the materials.",,Text/pdf,English,Text,kc0062_3_5_005,,,,,,,,,,,,,,,,,,,,,,,,,,,,,,,,,,,,,,,,,,,,,,,,,,,,,,,,,,,,,,,,,,,,,,,,,,,,,,"1960s,Families,Great Britain,Letters-English,Postcards",https://lebanesestudies.omeka.chass.ncsu.edu/files/original/d0f2d1c4ebbd0bbd5a845bc231312bad.pdf,,"Joseph Family Papers",1,1
81088,https://lebanesestudies.omeka.chass.ncsu.edu/items/show/81088,,,,,,,,,,,,,,,,,,,,,,,,,,,,,,,,,,,,,,,,,"Postcard of Nelson House","Lebanese Americans","Postcard featuring an image of Nelson House in Poughkeepsie, where Genevieve Norman and Charlie Joseph's wedding reception was help on March 2nd, 1946.",,"Genevieve Rose Joseph","Moise A. Khayrallah Center for Lebanese Diaspora Studies",undated,,"The donor retains full ownership of any copyright and rights currently controlled. Nonexclusive right to authorize uses of these materials for non-commercial research, scholarly, or other educational purposes are granted to Khayrallah Center pursuant to U.S. Copyright Law. Usage of the materials for these purposes must be fully credited with the source. The user assumes full responsibility for any use of the materials.",,Image/pdf,English,Image,kc0062_3_5_004,,,,,,,,,,,,,,,,,,,,,,,,,,,,,,,,,,,,,,,,,,,,,,,,,,,,,,,,,,,,,,,,,,,,,,,,,,,,,,"Postcards,Weddings",https://lebanesestudies.omeka.chass.ncsu.edu/files/original/be270093e9cd8ab6995a5ea79a3d302b.pdf,,"Joseph Family Papers",1,1
81087,https://lebanesestudies.omeka.chass.ncsu.edu/items/show/81087,,,,,,,,,,,,,,,,,,,,,,,,,,,,,,,,,,,,,,,,,"Postcard Addressed to Mr. and Mrs. Charlie Joseph","Lebanese Americans","Postcard with photograph of Beirut sent to Charlie and Genevieve Norman Joseph from Mary Hajje Boutros of the Ministry of Finance in Beirut, Lebanon.",,"Genevieve Rose Joseph","Moise A. Khayrallah Center for Lebanese Diaspora Studies","1966 Aug 10",,"The donor retains full ownership of any copyright and rights currently controlled. Nonexclusive right to authorize uses of these materials for non-commercial research, scholarly, or other educational purposes are granted to Khayrallah Center pursuant to U.S. Copyright Law. Usage of the materials for these purposes must be fully credited with the source. The user assumes full responsibility for any use of the materials.",,Text/pdf,English,Text,kc0062_3_5_003,,,,,,,,,,,,,,,,,,,,,,,,,,,,,,,,,,,,,,,,,,,,,,,,,,,,,,,,,,,,,,,,,,,,,,,,,,,,,,"1960s,Families,Lebanon,Letters-English,New York,Postcards",https://lebanesestudies.omeka.chass.ncsu.edu/files/original/6d2657f3b0cfa18d5b540b86178f0edb.pdf,,"Joseph Family Papers",1,1
81086,https://lebanesestudies.omeka.chass.ncsu.edu/items/show/81086,,,,,,,,,,,,,,,,,,,,,,,,,,,,,,,,,,,,,,,,,"Lebanese Postage Stamp","Lebanese Americans^^Photographs","Postage stamp from Byblos, Lebanon.",,"Genevieve Rose Joseph","Moise A. Khayrallah Center for Lebanese Diaspora Studies",undated,,"The donor retains full ownership of any copyright and rights currently controlled. Nonexclusive right to authorize uses of these materials for non-commercial research, scholarly, or other educational purposes are granted to Khayrallah Center pursuant to U.S. Copyright Law. Usage of the materials for these purposes must be fully credited with the source. The user assumes full responsibility for any use of the materials.",,Image/pdf,Arabic^^French,Image,kc0062_3_5_002,,,,,,,,,,,,,,,,,,,,,,,,,,,,,,,,,,,,,,,,,,,,,,,,,,,,,,,,,,,,,,,,,,,,,,,,,,,,,,,https://lebanesestudies.omeka.chass.ncsu.edu/files/original/f10ab1d051d3c42715fc3d3526c15cfe.pdf,,"Joseph Family Papers",1,1
81085,https://lebanesestudies.omeka.chass.ncsu.edu/items/show/81085,,,,,,,,,,,,,,,,,,,,,,,,,,,,,,,,,,,,,,,,,"Lebanese Postage Stamp","Lebanese Americans^^Photographs","Postage stamp from Lebanon.",,"Genevieve Rose Joseph","Moise A. Khayrallah Center for Lebanese Diaspora Studies",undated,,"The donor retains full ownership of any copyright and rights currently controlled. Nonexclusive right to authorize uses of these materials for non-commercial research, scholarly, or other educational purposes are granted to Khayrallah Center pursuant to U.S. Copyright Law. Usage of the materials for these purposes must be fully credited with the source. The user assumes full responsibility for any use of the materials.",,Image/pdf,Arabic^^French,Image,kc0062_3_5_001,,,,,,,,,,,,,,,,,,,,,,,,,,,,,,,,,,,,,,,,,,,,,,,,,,,,,,,,,,,,,,,,,,,,,,,,,,,,,,,https://lebanesestudies.omeka.chass.ncsu.edu/files/original/98602ac268765fdd8f1b460048bb7cc9.pdf,,"Joseph Family Papers",1,1
81084,https://lebanesestudies.omeka.chass.ncsu.edu/items/show/81084,,,,,,,,,,,,,,,,,,,,,,,,,,,,,,,,,,,,,,,,,"Portrait of Man and Woman","Lebanese Americans^^ Photographs","Portrait of a man and woman.",,"Genevieve Rose Joseph","Moise A. Khayrallah Center for Lebanese Diaspora Studies",undated,,"The donor retains full ownership of any copyright and rights currently controlled. Nonexclusive right to authorize uses of these materials for non-commercial research, scholarly, or other educational purposes are granted to Khayrallah Center pursuant to U.S. Copyright Law. Usage of the materials for these purposes must be fully credited with the source. The user assumes full responsibility for any use of the materials.",,Image/pdf,Arabic,Image,kc0062_3_4_012,,,,,,,,,,,,,,,,,,,,,,,,,,,,,,,,,,,,,,,,,,,,,,,,,,,,,,,,,,,,,,,,,,,,,,,,,,,,,,portrait,https://lebanesestudies.omeka.chass.ncsu.edu/files/original/45eb1ef882ce2ae6d6dc9b964b073424.pdf,,"Joseph Family Papers",1,1
81083,https://lebanesestudies.omeka.chass.ncsu.edu/items/show/81083,,,,,,,,,,,,,,,,,,,,,,,,,,,,,,,,,,,,,,,,,"Wedding Portrait Postcard","Lebanese Americans^^ Photographs","Postcard printed with a portrait of a man and woman dressed for their wedding. A stamp on the back of the photograph contains the name Frederick Difrani, possibly the photographer.",,"Genevieve Rose Joseph","Moise A. Khayrallah Center for Lebanese Diaspora Studies",undated,,"The donor retains full ownership of any copyright and rights currently controlled. Nonexclusive right to authorize uses of these materials for non-commercial research, scholarly, or other educational purposes are granted to Khayrallah Center pursuant to U.S. Copyright Law. Usage of the materials for these purposes must be fully credited with the source. The user assumes full responsibility for any use of the materials.",,Image/pdf,Arabic,Image,kc0062_3_4_011,,,,,,,,,,,,,,,,,,,,,,,,,,,,,,,,,,,,,,,,,,,,,,,,,,,,,,,,,,,,,,,,,,,,,,,,,,,,,,"Events,portrait,Postcards,Weddings",https://lebanesestudies.omeka.chass.ncsu.edu/files/original/ce55df040183f57b74e32c540e30e60e.pdf,,"Joseph Family Papers",1,1
81082,https://lebanesestudies.omeka.chass.ncsu.edu/items/show/81082,,,,,,,,,,,,,,,,,,,,,,,,,,,,,,,,,,,,,,,,,"Wedding Portrait","Lebanese Americans^^ Photographs","Portrait of a man and woman dressed for their wedding. A stamp on the back of the photograph contains the name Frederick Difrani, possibly the photographer.",,"Genevieve Rose Joseph","Moise A. Khayrallah Center for Lebanese Diaspora Studies",undated,,"The donor retains full ownership of any copyright and rights currently controlled. Nonexclusive right to authorize uses of these materials for non-commercial research, scholarly, or other educational purposes are granted to Khayrallah Center pursuant to U.S. Copyright Law. Usage of the materials for these purposes must be fully credited with the source. The user assumes full responsibility for any use of the materials.",,Image/pdf,Arabic,Image,kc0062_3_4_010,,,,,,,,,,,,,,,,,,,,,,,,,,,,,,,,,,,,,,,,,,,,,,,,,,,,,,,,,,,,,,,,,,,,,,,,,,,,,,"Events,portrait,Weddings",https://lebanesestudies.omeka.chass.ncsu.edu/files/original/89d050044d705cd01008cfeb98accd6e.pdf,,"Joseph Family Papers",1,1
81081,https://lebanesestudies.omeka.chass.ncsu.edu/items/show/81081,,,,,,,,,,,,,,,,,,,,,,,,,,,,,,,,,,,,,,,,,"Postcard of Woman","Lebanese Americans^^ Photographs","Postcard printed with a photograph of a woman.",,"Genevieve Rose Joseph","Moise A. Khayrallah Center for Lebanese Diaspora Studies",undated,,"The donor retains full ownership of any copyright and rights currently controlled. Nonexclusive right to authorize uses of these materials for non-commercial research, scholarly, or other educational purposes are granted to Khayrallah Center pursuant to U.S. Copyright Law. Usage of the materials for these purposes must be fully credited with the source. The user assumes full responsibility for any use of the materials.",,Image/pdf,Arabic,Image,kc0062_3_4_009,,,,,,,,,,,,,,,,,,,,,,,,,,,,,,,,,,,,,,,,,,,,,,,,,,,,,,,,,,,,,,,,,,,,,,,,,,,,,,Postcards,https://lebanesestudies.omeka.chass.ncsu.edu/files/original/08acc9b9f225322548aa913704d7b511.pdf,,"Joseph Family Papers",1,1
81080,https://lebanesestudies.omeka.chass.ncsu.edu/items/show/81080,,,,,,,,,,,,,,,,,,,,,,,,,,,,,,,,,,,,,,,,,"Baby with Pacifier","Lebanese Americans^^ Photographs","Photograph of a baby with a pacifier lying on blankets.",,"Genevieve Rose Joseph","Moise A. Khayrallah Center for Lebanese Diaspora Studies","circa 1950",,"The donor retains full ownership of any copyright and rights currently controlled. Nonexclusive right to authorize uses of these materials for non-commercial research, scholarly, or other educational purposes are granted to Khayrallah Center pursuant to U.S. Copyright Law. Usage of the materials for these purposes must be fully credited with the source. The user assumes full responsibility for any use of the materials.",,Image/pdf,Arabic,Image,kc0062_3_4_008,,,,,,,,,,,,,,,,,,,,,,,,,,,,,,,,,,,,,,,,,,,,,,,,,,,,,,,,,,,,,,,,,,,,,,,,,,,,,,"Families,Lebanon,portrait",https://lebanesestudies.omeka.chass.ncsu.edu/files/original/89dd24194d16d03dad2a034d4dae4158.pdf,,"Joseph Family Papers",1,1
81079,https://lebanesestudies.omeka.chass.ncsu.edu/items/show/81079,,,,,,,,,,,,,,,,,,,,,,,,,,,,,,,,,,,,,,,,,"Portrait of Akira Dow","Lebanese Americans^^ Photographs","Portrait of a young woman, Akira Dow, who was related to Rose Nader Norman.",,"Genevieve Rose Joseph","Moise A. Khayrallah Center for Lebanese Diaspora Studies",undated,,"The donor retains full ownership of any copyright and rights currently controlled. Nonexclusive right to authorize uses of these materials for non-commercial research, scholarly, or other educational purposes are granted to Khayrallah Center pursuant to U.S. Copyright Law. Usage of the materials for these purposes must be fully credited with the source. The user assumes full responsibility for any use of the materials.",,Image/pdf,Arabic,Image,kc0062_3_4_007,,,,,,,,,,,,,,,,,,,,,,,,,,,,,,,,,,,,,,,,,,,,,,,,,,,,,,,,,,,,,,,,,,,,,,,,,,,,,,"Families,Lebanon,portrait",https://lebanesestudies.omeka.chass.ncsu.edu/files/original/9e3c979d4fa8f9538ec858020c1014cb.pdf,,"Joseph Family Papers",1,1
81078,https://lebanesestudies.omeka.chass.ncsu.edu/items/show/81078,,,,,,,,,,,,,,,,,,,,,,,,,,,,,,,,,,,,,,,,,"Portrait of Young Woman","Lebanese Americans^^ Photographs","Portrait of a young woman.",,"Genevieve Rose Joseph","Moise A. Khayrallah Center for Lebanese Diaspora Studies",undated,,"The donor retains full ownership of any copyright and rights currently controlled. Nonexclusive right to authorize uses of these materials for non-commercial research, scholarly, or other educational purposes are granted to Khayrallah Center pursuant to U.S. Copyright Law. Usage of the materials for these purposes must be fully credited with the source. The user assumes full responsibility for any use of the materials.",,Image/pdf,Arabic,Image,kc0062_3_4_006,,,,,,,,,,,,,,,,,,,,,,,,,,,,,,,,,,,,,,,,,,,,,,,,,,,,,,,,,,,,,,,,,,,,,,,,,,,,,,"Families,Lebanon,portrait",https://lebanesestudies.omeka.chass.ncsu.edu/files/original/e4621585c435284bab6f0455d760b814.pdf,,"Joseph Family Papers",1,1
81077,https://lebanesestudies.omeka.chass.ncsu.edu/items/show/81077,,,,,,,,,,,,,,,,,,,,,,,,,,,,,,,,,,,,,,,,,"Portrait of Mishel Dow","Lebanese Americans^^ Photographs","Portrait of a young man, Mishel Dow, who was related to Rose Nader Norman.",,"Genevieve Rose Joseph","Moise A. Khayrallah Center for Lebanese Diaspora Studies",undated,,"The donor retains full ownership of any copyright and rights currently controlled. Nonexclusive right to authorize uses of these materials for non-commercial research, scholarly, or other educational purposes are granted to Khayrallah Center pursuant to U.S. Copyright Law. Usage of the materials for these purposes must be fully credited with the source. The user assumes full responsibility for any use of the materials.",,Image/pdf,Arabic,Image,kc0062_3_4_005,,,,,,,,,,,,,,,,,,,,,,,,,,,,,,,,,,,,,,,,,,,,,,,,,,,,,,,,,,,,,,,,,,,,,,,,,,,,,,"Families,Lebanon,portrait",https://lebanesestudies.omeka.chass.ncsu.edu/files/original/5ef80b2c810278c9b17851cf4c2f0d07.pdf,,"Joseph Family Papers",1,1
81076,https://lebanesestudies.omeka.chass.ncsu.edu/items/show/81076,,,,,,,,,,,,,,,,,,,,,,,,,,,,,,,,,,,,,,,,,"Portrait of Elias Dow","Lebanese Americans^^ Photographs","Portrait of a young man, Elias Dow, who was related to Rose Nader Norman.",,"Genevieve Rose Joseph","Moise A. Khayrallah Center for Lebanese Diaspora Studies",undated,,"The donor retains full ownership of any copyright and rights currently controlled. Nonexclusive right to authorize uses of these materials for non-commercial research, scholarly, or other educational purposes are granted to Khayrallah Center pursuant to U.S. Copyright Law. Usage of the materials for these purposes must be fully credited with the source. The user assumes full responsibility for any use of the materials.",,Image/pdf,Arabic,Image,kc0062_3_4_004,,,,,,,,,,,,,,,,,,,,,,,,,,,,,,,,,,,,,,,,,,,,,,,,,,,,,,,,,,,,,,,,,,,,,,,,,,,,,,"Families,Lebanon,portrait",https://lebanesestudies.omeka.chass.ncsu.edu/files/original/14b63fcfc5a8b1175f08ae7d2ac6283d.pdf,,"Joseph Family Papers",1,1
81075,https://lebanesestudies.omeka.chass.ncsu.edu/items/show/81075,,,,,,,,,,,,,,,,,,,,,,,,,,,,,,,,,,,,,,,,,"Boy and Father on Bicycle","Lebanese Americans^^ Photographs","Photograph of young boy and his father on a bicycle in Lebanon. Probably sent to the Norman family in New York.",,"Genevieve Rose Joseph","Moise A. Khayrallah Center for Lebanese Diaspora Studies","1953 Nov 22",,"The donor retains full ownership of any copyright and rights currently controlled. Nonexclusive right to authorize uses of these materials for non-commercial research, scholarly, or other educational purposes are granted to Khayrallah Center pursuant to U.S. Copyright Law. Usage of the materials for these purposes must be fully credited with the source. The user assumes full responsibility for any use of the materials.",,Image/pdf,English,Image,kc0062_3_4_003,,,,,,,,,,,,,,,,,,,,,,,,,,,,,,,,,,,,,,,,,,,,,,,,,,,,,,,,,,,,,,,,,,,,,,,,,,,,,,"1950s,Families,Lebanon",https://lebanesestudies.omeka.chass.ncsu.edu/files/original/2b36b9388f84b024dadbfcf4ad5ba518.pdf,,"Joseph Family Papers",1,1
81074,https://lebanesestudies.omeka.chass.ncsu.edu/items/show/81074,,,,,,,,,,,,,,,,,,,,,,,,,,,,,,,,,,,,,,,,,"Boy Sitting Atop Table","Lebanese Americans^^ Photographs","Photograph of a young boy seated atop a table beside a vase of flowers. Note on back of another copy states that the boy was the half-nephew of Genevieve Norman Joseph and resided in Lebanon. Note on this copy states the boy's name and addresses the photograph to ""Grandmother Rose.""",,"Genevieve Rose Joseph","Moise A. Khayrallah Center for Lebanese Diaspora Studies","1953 Nov 22",,"The donor retains full ownership of any copyright and rights currently controlled. Nonexclusive right to authorize uses of these materials for non-commercial research, scholarly, or other educational purposes are granted to Khayrallah Center pursuant to U.S. Copyright Law. Usage of the materials for these purposes must be fully credited with the source. The user assumes full responsibility for any use of the materials.",,Image/pdf,English,Image,kc0062_3_4_002,,,,,,,,,,,,,,,,,,,,,,,,,,,,,,,,,,,,,,,,,,,,,,,,,,,,,,,,,,,,,,,,,,,,,,,,,,,,,,"1950s,Families,Lebanon",https://lebanesestudies.omeka.chass.ncsu.edu/files/original/8e5101fc8a111b57fa3fe5a5c0092523.pdf,,"Joseph Family Papers",1,1
81073,https://lebanesestudies.omeka.chass.ncsu.edu/items/show/81073,,,,,,,,,,,,,,,,,,,,,,,,,,,,,,,,,,,,,,,,,"Photograph of Children","Lebanese Americans^^ Photographs","Photograph of three children.",,"Genevieve Rose Joseph","Moise A. Khayrallah Center for Lebanese Diaspora Studies",undated,,"The donor retains full ownership of any copyright and rights currently controlled. Nonexclusive right to authorize uses of these materials for non-commercial research, scholarly, or other educational purposes are granted to Khayrallah Center pursuant to U.S. Copyright Law. Usage of the materials for these purposes must be fully credited with the source. The user assumes full responsibility for any use of the materials.",,Image/pdf,English,Image,kc0062_3_4_001,,,,,,,,,,,,,,,,,,,,,,,,,,,,,,,,,,,,,,,,,,,,,,,,,,,,,,,,,,,,,,,,,,,,,,,,,,,,,,,https://lebanesestudies.omeka.chass.ncsu.edu/files/original/0f5831b0af9235d81f24addfeb14b5cd.pdf,,"Joseph Family Papers",1,1
81072,https://lebanesestudies.omeka.chass.ncsu.edu/items/show/81072,,,,,,,,,,,,,,,,,,,,,,,,,,,,,,,,,,,,,,,,,"Michael Joseph in Restaurant","Lebanese Americans^^ Photographs","Photograph of Michael Joseph in a restaurant in Wendell, North Carolina.",,"Genevieve Rose Joseph","Moise A. Khayrallah Center for Lebanese Diaspora Studies",2006,,"The donor retains full ownership of any copyright and rights currently controlled. Nonexclusive right to authorize uses of these materials for non-commercial research, scholarly, or other educational purposes are granted to Khayrallah Center pursuant to U.S. Copyright Law. Usage of the materials for these purposes must be fully credited with the source. The user assumes full responsibility for any use of the materials.",,Image/pdf,English,Image,kc0062_3_3_015,,,,,,,,,,,,,,,,,,,,,,,,,,,,,,,,,,,,,,,,,,,,,,,,,,,,,,,,,,,,,,,,,,,,,,,,,,,,,,"2000s,Business,Food,North Carolina",https://lebanesestudies.omeka.chass.ncsu.edu/files/original/5de484c7c2ed7d4044ee262e474158b9.pdf,,"Joseph Family Papers",1,1
81071,https://lebanesestudies.omeka.chass.ncsu.edu/items/show/81071,,,,,,,,,,,,,,,,,,,,,,,,,,,,,,,,,,,,,,,,,"Genevieve R. Joseph with Relatives in Lebanon","Lebanese Americans^^ Photographs","Photograph of Genevieve R. Joseph seated with two relatives in Lebanon.",,"Genevieve Rose Joseph","Moise A. Khayrallah Center for Lebanese Diaspora Studies","2002 Sep",,"The donor retains full ownership of any copyright and rights currently controlled. Nonexclusive right to authorize uses of these materials for non-commercial research, scholarly, or other educational purposes are granted to Khayrallah Center pursuant to U.S. Copyright Law. Usage of the materials for these purposes must be fully credited with the source. The user assumes full responsibility for any use of the materials.",,Image/pdf,English,Image,kc0062_3_3_014,,,,,,,,,,,,,,,,,,,,,,,,,,,,,,,,,,,,,,,,,,,,,,,,,,,,,,,,,,,,,,,,,,,,,,,,,,,,,,"2000s,Families,Lebanon,Travel",https://lebanesestudies.omeka.chass.ncsu.edu/files/original/bfbb33dfe7289956f040f463365dce28.pdf,,"Joseph Family Papers",1,1