﻿"Item Id","Item URI","Dublin Core:Alternative Title","Dublin Core:Abstract","Dublin Core:Table Of Contents","Dublin Core:Date Available","Dublin Core:Date Created","Dublin Core:Date Accepted","Dublin Core:Date Copyrighted","Dublin Core:Date Submitted","Dublin Core:Date Issued","Dublin Core:Date Modified","Dublin Core:Date Valid","Dublin Core:Access Rights","Dublin Core:License","Dublin Core:Conforms To","Dublin Core:Has Format","Dublin Core:Has Part","Dublin Core:Has Version","Dublin Core:Is Format Of","Dublin Core:Is Part Of","Dublin Core:Is Referenced By","Dublin Core:Is Replaced By","Dublin Core:Is Required By","Dublin Core:Is Version Of","Dublin Core:References","Dublin Core:Replaces","Dublin Core:Requires","Dublin Core:Extent","Dublin Core:Medium","Dublin Core:Bibliographic Citation","Dublin Core:Spatial Coverage","Dublin Core:Temporal Coverage","Dublin Core:Accrual Method","Dublin Core:Accrual Periodicity","Dublin Core:Accrual Policy","Dublin Core:Audience","Dublin Core:Audience Education Level","Dublin Core:Mediator","Dublin Core:Instructional Method","Dublin Core:Provenance","Dublin Core:Rights Holder","Dublin Core:Title","Dublin Core:Subject","Dublin Core:Description","Dublin Core:Creator","Dublin Core:Source","Dublin Core:Publisher","Dublin Core:Date","Dublin Core:Contributor","Dublin Core:Rights","Dublin Core:Relation","Dublin Core:Format","Dublin Core:Language","Dublin Core:Type","Dublin Core:Identifier","Dublin Core:Coverage","Item Type Metadata:Text","Item Type Metadata:Interviewer","Item Type Metadata:Interviewee","Item Type Metadata:Location","Item Type Metadata:Transcription","Item Type Metadata:Local URL","Item Type Metadata:Original Format","Item Type Metadata:Physical Dimensions","Item Type Metadata:Duration","Item Type Metadata:Compression","Item Type Metadata:Producer","Item Type Metadata:Director","Item Type Metadata:Bit Rate/Frequency","Item Type Metadata:Time Summary","Item Type Metadata:Email Body","Item Type Metadata:Subject Line","Item Type Metadata:From","Item Type Metadata:To","Item Type Metadata:CC","Item Type Metadata:BCC","Item Type Metadata:Number of Attachments","Item Type Metadata:Standards","Item Type Metadata:Objectives","Item Type Metadata:Materials","Item Type Metadata:Lesson Plan Text","Item Type Metadata:URL","Item Type Metadata:Event Type","Item Type Metadata:Participants","Item Type Metadata:Birth Date","Item Type Metadata:Birthplace","Item Type Metadata:Death Date","Item Type Metadata:Occupation","Item Type Metadata:Biographical Text","Item Type Metadata:Bibliography","Item Type Metadata:First Name (English)","Item Type Metadata:Last Name (English)","Item Type Metadata:Address","Item Type Metadata:City","Item Type Metadata:State","Item Type Metadata:Business (English)","Item Type Metadata:Provenance (English)","Item Type Metadata:Provenance (Arabic)","Item Type Metadata:Business (Arabic)","Item Type Metadata:Last Name (Arabic)","Item Type Metadata:First Name (Arabic)","Item Type Metadata:Player","Omeka Legacy File:Additional Creator","Omeka Legacy File:Transcriber","Omeka Legacy File:Producer","Omeka Legacy File:Render Device","Omeka Legacy File:Render Details","Omeka Legacy File:Capture Date","Omeka Legacy File:Capture Device","Omeka Legacy File:Capture Details","Omeka Legacy File:Change History","Omeka Legacy File:Watermark","Omeka Legacy File:Encryption","Omeka Legacy File:Compression","Omeka Legacy File:Post Processing","Omeka Image File:Width","Omeka Image File:Height","Omeka Image File:Bit Depth","Omeka Image File:Channels","Omeka Image File:Exif String","Omeka Image File:Exif Array","Omeka Image File:IPTC String","Omeka Image File:IPTC Array","Omeka Video File:Bitrate","Omeka Video File:Duration","Omeka Video File:Sample Rate","Omeka Video File:Codec","Omeka Video File:Width","Omeka Video File:Height","PDF Text:Text","Users Elements:Test","Test Elements:Test",tags,file,itemType,collection,public,featured
82798,https://lebanesestudies.omeka.chass.ncsu.edu/items/show/82798,,,,,,,,,,,,,,,,,,,,,,,,,,,,,,,,,,,,,,,,,"Portrait of Young Child in Chair ","Lebanese--United States^^ Photographs^^ Families","A photograph of a young child in a studio. Note in French on the back translates to ""keepsake/memory to my dear Parisian. M. Harfauche. Mansourah 5-1-1918.""",,"Oussani Fuleihan family","Moise A. Khayrallah Center for Lebanese Diaspora Studies","1918 May 1",,"The donor retains full ownership of any copyright and rights currently controlled. Nonexclusive right to authorize uses of these materials for non-commercial research, scholarly, or other educational purposes are granted to Khayrallah Center pursuant to U.S. Copyright Law. Usage of the materials for these purposes must be fully credited with the source. The user assumes full responsibility for any use of the materials.",,Image/pdf,French,Image,Oussani2018-0420,,,,,,,,,,,,,,,,,,,,,,,,,,,,,,,,,,,,,,,,,,,,,,,,,,,,,,,,,,,,,,,,,,,,,,,,,,,,,,"1910s,portrait",https://lebanesestudies.omeka.chass.ncsu.edu/files/original/ac71319baa20aa563df4fc09de1855cd.pdf,,"Oussani and Fuleihan Family Papers Series 2: Photographs",1,0
69640,https://lebanesestudies.omeka.chass.ncsu.edu/items/show/69640,,,,,,,,,,,,,,,,,,,,,,,,,,,,,,,,,,,,,,,,,"Portrait of Rosita Assaf in High School, 1945 February 28",Photographs,"A portrait of Rosita Assaf in her 3rd year of High School, addressed to Theresa from Rosita, dated 28 February 1945",,"Kail Ellis","Moise A. Khayrallah Center for Lebanese Diaspora Studies",1945-02-28,,"Donor retains full ownership of any and all copyright currently controlled in agreement with Khayrallah Center. Nonexclusive right to authorize all uses of these materials for non-commercial research, scholarly, or other educational purposes are granted to Khayrallah Center pursuant to Creative Commons Attribution-NonCommercial-ShareAlike (CC BY-NC-SA).",,Image/pdf,English^^French,Image,KEllis2020-383,,,,,,,,,,,,,,,,,,,,,,,,,,,,,,,,,,,,,,,,,,,,,,,,,,,,,,,,,,,,,,,,,,,,,,,,,,,,,,"Theresa Ellis",https://lebanesestudies.omeka.chass.ncsu.edu/files/original/1747b35a60ce1c05801f994566a257ff.pdf,,"Angele Hobeiche Kmeid-Ellis Collection: Photographs",1,1
82710,https://lebanesestudies.omeka.chass.ncsu.edu/items/show/82710,,,,,,,,,,,,,,,,,,,,,,,,,,,,,,,,,,,,,,,,,"Portrait of Man in Suit and Tie","Lebanese--United States^^ Photographs^^ Families","A professional photograph of a man. ""Carte Postale"" written on back.",,"Oussani Fuleihan family","Moise A. Khayrallah Center for Lebanese Diaspora Studies","circa 1915",,"The donor retains full ownership of any copyright and rights currently controlled. Nonexclusive right to authorize uses of these materials for non-commercial research, scholarly, or other educational purposes are granted to Khayrallah Center pursuant to U.S. Copyright Law. Usage of the materials for these purposes must be fully credited with the source. The user assumes full responsibility for any use of the materials.",,Image/pdf,French,Image,Oussani2018-0508,,,,,,,,,,,,,,,,,,,,,,,,,,,,,,,,,,,,,,,,,,,,,,,,,,,,,,,,,,,,,,,,,,,,,,,,,,,,,,"1910s,portrait,Postcards",https://lebanesestudies.omeka.chass.ncsu.edu/files/original/980b82aa0c2217694e5ae8174851575c.pdf,,"Oussani and Fuleihan Family Papers Series 2: Photographs",1,0
82701,https://lebanesestudies.omeka.chass.ncsu.edu/items/show/82701,,,,,,,,,,,,,,,,,,,,,,,,,,,,,,,,,,,,,,,,,"Portrait of Man in Nature Themed Studio","Lebanese--United States^^ Photographs^^ Families","A photograph of a man posing in a studio. A French note on back states that the postcard is a reminder of the brotherhood and friendship of Nasri Fuleihan. ",,"Oussani Fuleihan family","Moise A. Khayrallah Center for Lebanese Diaspora Studies","circa 1915",,"The donor retains full ownership of any copyright and rights currently controlled. Nonexclusive right to authorize uses of these materials for non-commercial research, scholarly, or other educational purposes are granted to Khayrallah Center pursuant to U.S. Copyright Law. Usage of the materials for these purposes must be fully credited with the source. The user assumes full responsibility for any use of the materials.",,Image/pdf,French,Image,Oussani2018-0517,,,,,,,,,,,,,,,,,,,,,,,,,,,,,,,,,,,,,,,,,,,,,,,,,,,,,,,,,,,,,,,,,,,,,,,,,,,,,,"1910s,portrait",https://lebanesestudies.omeka.chass.ncsu.edu/files/original/30d926c9dfaa10281a35c1e5652d7eab.pdf,,"Oussani and Fuleihan Family Papers Series 2: Photographs",1,0
82769,https://lebanesestudies.omeka.chass.ncsu.edu/items/show/82769,,,,,,,,,,,,,,,,,,,,,,,,,,,,,,,,,,,,,,,,,"Portrait of Louisa Fuleihan","Lebanese--United States^^ Photographs^^ Families","Professional photograph of Louisa Fuleihan on a postcard.",,"Oussani Fuleihan family","Moise A. Khayrallah Center for Lebanese Diaspora Studies",1910s,,"The donor retains full ownership of any copyright and rights currently controlled. Nonexclusive right to authorize uses of these materials for non-commercial research, scholarly, or other educational purposes are granted to Khayrallah Center pursuant to U.S. Copyright Law. Usage of the materials for these purposes must be fully credited with the source. The user assumes full responsibility for any use of the materials.",,Image/pdf,French,Image,Oussani2018-0449,,,,,,,,,,,,,,,,,,,,,,,,,,,,,,,,,,,,,,,,,,,,,,,,,,,,,,,,,,,,,,,,,,,,,,,,,,,,,,"1910s,portrait,Postcards",https://lebanesestudies.omeka.chass.ncsu.edu/files/original/b37d3bf6ab93cf2b17296def98b16b84.pdf,,"Oussani and Fuleihan Family Papers Series 2: Photographs",1,0
80995,https://lebanesestudies.omeka.chass.ncsu.edu/items/show/80995,,,,,,,,,,,,,,,,,,,,,,,,,,,,,,,,,,,,,,,,,"Portrait of [Laudi?]","Lebanese Americans^^ Photographs","Studio portrait of a woman. Caption on back reads ""Laudi"" or ""Loudi.""","Studio Byblos","Genevieve Rose Joseph","Moise A. Khayrallah Center for Lebanese Diaspora Studies","1968 Feb 2",,"The donor retains full ownership of any copyright and rights currently controlled. Nonexclusive right to authorize uses of these materials for non-commercial research, scholarly, or other educational purposes are granted to Khayrallah Center pursuant to U.S. Copyright Law. Usage of the materials for these purposes must be fully credited with the source. The user assumes full responsibility for any use of the materials.",,Image/pdf,French,Image,kc0062_2_6_011,,,,,,,,,,,,,,,,,,,,,,,,,,,,,,,,,,,,,,,,,,,,,,,,,,,,,,,,,,,,,,,,,,,,,,,,,,,,,,portrait,https://lebanesestudies.omeka.chass.ncsu.edu/files/original/a03afc78b591ddaf1dc6a4d53e8ac09a.pdf,,"Joseph Family Papers",1,1
82593,https://lebanesestudies.omeka.chass.ncsu.edu/items/show/82593,,,,,,,,,,,,,,,,,,,,,,,,,,,,,,,,,,,,,,,,,"Photographic Negatives","Lebanese--United States^^ Photographs^^ Families","Envelope with photo negatives. There are some from a trip abroad, possibly to Egypt. Includes photographs of Isabel Oussani, Margaret Oussani, Leonard Oussani, and Nasri Fuleihan.","Société Anonym des Drogueries d'Egypte","Oussani Fuleihan family","Moise A. Khayrallah Center for Lebanese Diaspora Studies",1920s,,"The donor retains full ownership of any copyright and rights currently controlled. Nonexclusive right to authorize uses of these materials for non-commercial research, scholarly, or other educational purposes are granted to Khayrallah Center pursuant to U.S. Copyright Law. Usage of the materials for these purposes must be fully credited with the source. The user assumes full responsibility for any use of the materials.",,Image/pdf,French,Image,Oussani2018-0625,,,,,,,,,,,,,,,,,,,,,,,,,,,,,,,,,,,,,,,,,,,,,,,,,,,,,,,,,,,,,,,,,,,,,,,,,,,,,,"1920s,Egypt,Families,Travel",https://lebanesestudies.omeka.chass.ncsu.edu/files/original/13480e6118bbbaab14a7f46feb0a00b8.pdf,,"Oussani and Fuleihan Family Papers Series 2: Photographs",1,0
69570,https://lebanesestudies.omeka.chass.ncsu.edu/items/show/69570,,,,,,,,,,,,,,,,,,,,,,,,,,,,,,,,,,,,,,,,,"Photograph of Jouhaina Hobeiche, Faraj Joseph, and their son Alain, 1956",Photographs,"A copy of a  photograph of Jouhaina Hobeiche with her husband Faraj Joseph and their son Alain, dated 1956.",,"Kail Ellis","Moise A. Khayrallah Center for Lebanese Diaspora Studies",1956,,"Donor retains full ownership of any and all copyright currently controlled in agreement with Khayrallah Center. Nonexclusive right to authorize all uses of these materials for non-commercial research, scholarly, or other educational purposes are granted to Khayrallah Center pursuant to Creative Commons Attribution-NonCommercial-ShareAlike (CC BY-NC-SA).",,Image/pdf,French,Image,KEllis2019-233,,,,,,,,,,,,,,,,,,,,,,,,,,,,,,,,,,,,,,,,,,,,,,,,,,,,,,,,,,,,,,,,,,,,,,,,,,,,,,"1950s,Faraj Joseph,Hobeiche,Jouhaina Hobeiche",https://lebanesestudies.omeka.chass.ncsu.edu/files/original/003bad2c827ca81bc9e452404a667ccd.pdf,,"Angele Hobeiche Kmeid-Ellis Collection: Photographs",1,1
69041,https://lebanesestudies.omeka.chass.ncsu.edu/items/show/69041,,,,,,,,,,,,,,,,,,,,,,,,,,,,,,,,,,,,,,,,,"Passport for Angele Ellis, 1926 May 31",Passports,"A passport for Angele Hobeiche, dated 31 May 1926.","High Commission of the French Republic in Syria and Lebanon","Kail Ellis","Moise A. Khayrallah Center for Lebanese Diaspora Studies",1926-05-31,,"Donor retains full ownership of any and all copyright currently controlled in agreement with Khayrallah Center. Nonexclusive right to authorize all uses of these materials for non-commercial research, scholarly, or other educational purposes are granted to Khayrallah Center pursuant to Creative Commons Attribution-NonCommercial-ShareAlike (CC BY-NC-SA).",,Text/pdf,French,Text,KEllis2018-010,,,,,,,,,,,,,,,,,,,,,,,,,,,,,,,,,,,,,,,,,,,,,,,,,,,,,,,,,,,,,,,,,,,,,,,,,,,,,,"1920s,Angele Ellis,Ellis,Lebanese Stamps,Passport Photographs,Passports,Passports-France,Stamps",https://lebanesestudies.omeka.chass.ncsu.edu/files/original/e63fc65cbccdcb881f8c853374cf5262.pdf,,"Angele Hobeiche Kmeid-Ellis Collection: Correspondence",1,1
81108,https://lebanesestudies.omeka.chass.ncsu.edu/items/show/81108,,,,,,,,,,,,,,,,,,,,,,,,,,,,,,,,,,,,,,,,,"Note from Assad Logaib","Lebanese Americans","Note printed from Assad Logaib given alongside souvenir.",,"Genevieve Rose Joseph","Moise A. Khayrallah Center for Lebanese Diaspora Studies",undated,,"The donor retains full ownership of any copyright and rights currently controlled. Nonexclusive right to authorize uses of these materials for non-commercial research, scholarly, or other educational purposes are granted to Khayrallah Center pursuant to U.S. Copyright Law. Usage of the materials for these purposes must be fully credited with the source. The user assumes full responsibility for any use of the materials.",,Text/pdf,"French^^ English",Text,kc0062_3_7_011,,,,,,,,,,,,,,,,,,,,,,,,,,,,,,,,,,,,,,,,,,,,,,,,,,,,,,,,,,,,,,,,,,,,,,,,,,,,,,,https://lebanesestudies.omeka.chass.ncsu.edu/files/original/c6717af4c5d0264c8366e8a15e782a1a.pdf,,"Joseph Family Papers",1,1
82052,https://lebanesestudies.omeka.chass.ncsu.edu/items/show/82052,,,,,,,,,,,,,,,,,,,,,,,,,,,,,,,,,,,,,,,,,"Nasri Fuleihan Masonic Identity Card","Social groups","A masonic identity card in French for Nasri Fuleihan, one side of the document lists information including that it was given by Les Amis du progrès/Friends of Progress, of the Mansourah order, to Nasri. The other side features stamps for ""quarterly subscriptions"" earned during 1921-1923. ",,"Oussani Fuleihan family","Moise A. Khayrallah Center for Lebanese Diaspora Studies",1921,,"The donor retains full ownership of any copyright and rights currently controlled. Nonexclusive right to authorize uses of these materials for non-commercial research, scholarly, or other educational purposes are granted to Khayrallah Center pursuant to U.S. Copyright Law. Usage of the materials for these purposes must be fully credited with the source. The user assumes full responsibility for any use of the materials.",,Text/pdf,French,Text,Oussani2018-1081,,,,,,,,,,,,,,,,,,,,,,,,,,,,,,,,,,,,,,,,,,,,,,,,,,,,,,,,,,,,,,,,,,,,,,,,,,,,,,"1920s,Identifications Cards",https://lebanesestudies.omeka.chass.ncsu.edu/files/original/44fd265c3e56948b720adc5f0b34b8fc.pdf,,"Oussani and Fuleihan Family Papers Series 1: Documents",1,0
82602,https://lebanesestudies.omeka.chass.ncsu.edu/items/show/82602,,,,,,,,,,,,,,,,,,,,,,,,,,,,,,,,,,,,,,,,,"Nasri Fuleihan and Man at Table","Lebanese--United States^^ Photographs^^ Families","A photograph of Nasri Fuleihan and man sitting at a table.",,"Oussani Fuleihan family","Moise A. Khayrallah Center for Lebanese Diaspora Studies",1920s,,"The donor retains full ownership of any copyright and rights currently controlled. Nonexclusive right to authorize uses of these materials for non-commercial research, scholarly, or other educational purposes are granted to Khayrallah Center pursuant to U.S. Copyright Law. Usage of the materials for these purposes must be fully credited with the source. The user assumes full responsibility for any use of the materials.",,Image/pdf,French,Image,Oussani2018-0616,,,,,,,,,,,,,,,,,,,,,,,,,,,,,,,,,,,,,,,,,,,,,,,,,,,,,,,,,,,,,,,,,,,,,,,,,,,,,,1920s,https://lebanesestudies.omeka.chass.ncsu.edu/files/original/9cb10a460f83a867e8e2d9420b371074.pdf,,"Oussani and Fuleihan Family Papers Series 2: Photographs",1,0
78612,https://lebanesestudies.omeka.chass.ncsu.edu/items/show/78612,,,,,,,,,,,,,,,,,,,,,,,,,,,,,,,,,,,,,,,,,"Najeeb Tannous Letter",Correspondence,"A handwritten letter in Arabic. Confirms the baptism of Najeeb, son of Tannous Awadh, on April 2, 1897, by Father Khouri Necholas Ghattass. Written by Father Khouri Elias (last name not clear) on August 3, 1913. ",,"Lawrence Public Library Special Collections","Moise A. Khayrallah Center for Lebanese Diaspora Studies","1913 Aug 3",,"The donor retains full ownership of any copyright and rights currently controlled. Nonexclusive right to authorize uses of these materials for non-commercial research, scholarly, or other educational purposes are granted to Khayrallah Center pursuant to U.S. Copyright Law. Usage of the materials for these purposes must be fully credited with the source. The user assumes full responsibility for any use of the materials.",,Text/pdf,French^^Arabic,Text,LPL_BRR_ThomasA001_wm,,,,,,,,,,,,,,,,,,,,,,,,,,,,,,,,,,,,,,,,,,,,,,,,,,,,,,,,,,,,,,,,,,,,,,,,,,,,,,"1910s,Baptisms,Letters-Arabic",https://lebanesestudies.omeka.chass.ncsu.edu/files/original/3fc9d52a5ee6edae4c0c4c3bb67da608.pdf,,"Collection of Lawrence Public Library Materials",1,0
68964,https://lebanesestudies.omeka.chass.ncsu.edu/items/show/68964,,,,,,,,,,,,,,,,,,,,,,,,,,,,,,,,,,,,,,,,,"Médaille Commémorative du Liban, certificate awarded to Yousef Hobeiche, 1928 June 15",Certificate,"A copy of a Médaille Commémorative du Liban awarded to Yousef Hobeiche on June 15, 1928, issued in Beirut, Lebanon. ","Republic of Lebanon","Kail Ellis","Moise A. Khayrallah Center for Lebanese Diaspora Studies",1928-06-15,,"Donor retains full ownership of any and all copyright currently controlled in agreement with Khayrallah Center. Nonexclusive right to authorize all uses of these materials for non-commercial research, scholarly, or other educational purposes are granted to Khayrallah Center pursuant to Creative Commons Attribution-NonCommercial-ShareAlike (CC BY-NC-SA).",,Image/pdf,French,Image,KEllis2020-341,,,,,,,,,,,,,,,,,,,,,,,,,,,,,,,,,,,,,,,,,,,,,,,,,,,,,,,,,,,,,,,,,,,,,,,,,,,,,,"Yousef Hobeiche",https://lebanesestudies.omeka.chass.ncsu.edu/files/original/2d8970ca1d48200c67799df17fcdfbb8.pdf,,"Angele Hobeiche Kmeid-Ellis Collection: Correspondence",1,1
78615,https://lebanesestudies.omeka.chass.ncsu.edu/items/show/78615,,,,,,,,,,,,,,,,,,,,,,,,,,,,,,,,,,,,,,,,,"Mary Trabulsky Application for Employment","Textile industry","An application for employment certificate for Mary Trabulsky to work at Ayer Mills for T. Forrest, produced on September 2, 1913. It lists her address as Elm St. and her date of birth as July 3, 1895. There is a brown envelope at the bottom that reads ""Trabolsi, Mariam see Trabulsky, Mary.""","Ayer Mills","Lawrence Public Library Special Collections","Moise A. Khayrallah Center for Lebanese Diaspora Studies","1913 Sept 2","T. Forrest","The donor retains full ownership of any copyright and rights currently controlled. Nonexclusive right to authorize uses of these materials for non-commercial research, scholarly, or other educational purposes are granted to Khayrallah Center pursuant to U.S. Copyright Law. Usage of the materials for these purposes must be fully credited with the source. The user assumes full responsibility for any use of the materials.",,Text/pdf,French,Text,LPL_BRR_TarabolsiMarian002_wm,"Lawrence, Massachusetts",,,,,,,,,,,,,,,,,,,,,,,,,,,,,,,,,,,,,,,,,,,,,,,,,,,,,,,,,,,,,,,,,,,,,,,,,,,,,"1910s,Applications,Labor,Mills,Occupations-Factory worker",https://lebanesestudies.omeka.chass.ncsu.edu/files/original/26f29a9a04d9b00b763525eef8da6102.pdf,,"Collection of Lawrence Public Library Materials",1,0
78634,https://lebanesestudies.omeka.chass.ncsu.edu/items/show/78634,,,,,,,,,,,,,,,,,,,,,,,,,,,,,,,,,,,,,,,,,"Mary Sign Literacy Record",Education,"A Minor's Certificate of Literacy for Mary Sign created on August 19, 1913. It indicates that she lived at 99 Valley St., was more than 16 years old, and was born December 28, 1894, in Syria. It also confirms that she could read and write legibly. On the back is Mary Sign's signature.","Lawrence Public Schools","Lawrence Public Library Special Collections","Moise A. Khayrallah Center for Lebanese Diaspora Studies","1913 Aug 19","E. J. Cate","The donor retains full ownership of any copyright and rights currently controlled. Nonexclusive right to authorize uses of these materials for non-commercial research, scholarly, or other educational purposes are granted to Khayrallah Center pursuant to U.S. Copyright Law. Usage of the materials for these purposes must be fully credited with the source. The user assumes full responsibility for any use of the materials.",,Text/pdf,French,Text,LPL_BRR_SignMary001_wm,"Lawrence, Massachusetts",,,,,,,,,,,,,,,,,,,,,,,,,,,,,,,,,,,,,,,,,,,,,,,,,,,,,,,,,,,,,,,,,,,,,,,,,,,,,"1910s,Education,Records",https://lebanesestudies.omeka.chass.ncsu.edu/files/original/1c3436d05c49b1015c4687155e992823.pdf,,"Collection of Lawrence Public Library Materials",1,0
78617,https://lebanesestudies.omeka.chass.ncsu.edu/items/show/78617,,,,,,,,,,,,,,,,,,,,,,,,,,,,,,,,,,,,,,,,,"Mary Najjim Application for Employment","Textile industry","An application for employment certificate of Marian Najjim created on November 6, 1912. It lists her birthdate as October, 1895, and her address as 116 Valley St. The document is signed by Mr. Wenberg, overseer of the mill. The permit is affixed to the back of the immigration record of Mary Tanous.","Washington Mills","Lawrence Public Library Special Collections","Moise A. Khayrallah Center for Lebanese Diaspora Studies","1912 Nov 6",,"The donor retains full ownership of any copyright and rights currently controlled. Nonexclusive right to authorize uses of these materials for non-commercial research, scholarly, or other educational purposes are granted to Khayrallah Center pursuant to U.S. Copyright Law. Usage of the materials for these purposes must be fully credited with the source. The user assumes full responsibility for any use of the materials.",,Text/pdf,French,Text,LPL_BRR_TanousMarian002_wm,"Lawrence, Massachusetts",,,,,,,,,,,,,,,,,,,,,,,,,,,,,,,,,,,,,,,,,,,,,,,,,,,,,,,,,,,,,,,,,,,,,,,,,,,,,"1910s,Applications,Labor,Mills,Occupations-Factory worker",https://lebanesestudies.omeka.chass.ncsu.edu/files/original/17cefb1300d15631c0517bdad9582289.pdf,,"Collection of Lawrence Public Library Materials",1,0
81263,https://lebanesestudies.omeka.chass.ncsu.edu/items/show/81263,,,,,,,,,,,,,,,,,,,,,,,,,,,,,,,,,,,,,,,,,"Marriage Certificate of As'ad Gantous and Nazha Anaissi, 1936 March 01^^عنوان الرسالة: 