﻿"Item Id","Item URI","Dublin Core:Alternative Title","Dublin Core:Abstract","Dublin Core:Table Of Contents","Dublin Core:Date Available","Dublin Core:Date Created","Dublin Core:Date Accepted","Dublin Core:Date Copyrighted","Dublin Core:Date Submitted","Dublin Core:Date Issued","Dublin Core:Date Modified","Dublin Core:Date Valid","Dublin Core:Access Rights","Dublin Core:License","Dublin Core:Conforms To","Dublin Core:Has Format","Dublin Core:Has Part","Dublin Core:Has Version","Dublin Core:Is Format Of","Dublin Core:Is Part Of","Dublin Core:Is Referenced By","Dublin Core:Is Replaced By","Dublin Core:Is Required By","Dublin Core:Is Version Of","Dublin Core:References","Dublin Core:Replaces","Dublin Core:Requires","Dublin Core:Extent","Dublin Core:Medium","Dublin Core:Bibliographic Citation","Dublin Core:Spatial Coverage","Dublin Core:Temporal Coverage","Dublin Core:Accrual Method","Dublin Core:Accrual Periodicity","Dublin Core:Accrual Policy","Dublin Core:Audience","Dublin Core:Audience Education Level","Dublin Core:Mediator","Dublin Core:Instructional Method","Dublin Core:Provenance","Dublin Core:Rights Holder","Dublin Core:Title","Dublin Core:Subject","Dublin Core:Description","Dublin Core:Creator","Dublin Core:Source","Dublin Core:Publisher","Dublin Core:Date","Dublin Core:Contributor","Dublin Core:Rights","Dublin Core:Relation","Dublin Core:Format","Dublin Core:Language","Dublin Core:Type","Dublin Core:Identifier","Dublin Core:Coverage","Item Type Metadata:Text","Item Type Metadata:Interviewer","Item Type Metadata:Interviewee","Item Type Metadata:Location","Item Type Metadata:Transcription","Item Type Metadata:Local URL","Item Type Metadata:Original Format","Item Type Metadata:Physical Dimensions","Item Type Metadata:Duration","Item Type Metadata:Compression","Item Type Metadata:Producer","Item Type Metadata:Director","Item Type Metadata:Bit Rate/Frequency","Item Type Metadata:Time Summary","Item Type Metadata:Email Body","Item Type Metadata:Subject Line","Item Type Metadata:From","Item Type Metadata:To","Item Type Metadata:CC","Item Type Metadata:BCC","Item Type Metadata:Number of Attachments","Item Type Metadata:Standards","Item Type Metadata:Objectives","Item Type Metadata:Materials","Item Type Metadata:Lesson Plan Text","Item Type Metadata:URL","Item Type Metadata:Event Type","Item Type Metadata:Participants","Item Type Metadata:Birth Date","Item Type Metadata:Birthplace","Item Type Metadata:Death Date","Item Type Metadata:Occupation","Item Type Metadata:Biographical Text","Item Type Metadata:Bibliography","Item Type Metadata:First Name (English)","Item Type Metadata:Last Name (English)","Item Type Metadata:Address","Item Type Metadata:City","Item Type Metadata:State","Item Type Metadata:Business (English)","Item Type Metadata:Provenance (English)","Item Type Metadata:Provenance (Arabic)","Item Type Metadata:Business (Arabic)","Item Type Metadata:Last Name (Arabic)","Item Type Metadata:First Name (Arabic)","Item Type Metadata:Player","Omeka Legacy File:Additional Creator","Omeka Legacy File:Transcriber","Omeka Legacy File:Producer","Omeka Legacy File:Render Device","Omeka Legacy File:Render Details","Omeka Legacy File:Capture Date","Omeka Legacy File:Capture Device","Omeka Legacy File:Capture Details","Omeka Legacy File:Change History","Omeka Legacy File:Watermark","Omeka Legacy File:Encryption","Omeka Legacy File:Compression","Omeka Legacy File:Post Processing","Omeka Image File:Width","Omeka Image File:Height","Omeka Image File:Bit Depth","Omeka Image File:Channels","Omeka Image File:Exif String","Omeka Image File:Exif Array","Omeka Image File:IPTC String","Omeka Image File:IPTC Array","Omeka Video File:Bitrate","Omeka Video File:Duration","Omeka Video File:Sample Rate","Omeka Video File:Codec","Omeka Video File:Width","Omeka Video File:Height","PDF Text:Text","Users Elements:Test","Test Elements:Test",tags,file,itemType,collection,public,featured
87560,https://lebanesestudies.omeka.chass.ncsu.edu/items/show/87560,,,,,,,,,,,,,,,,,,,,,,,,,,,,,,,,,,,,,,,,,"Rihani Nude Sketches, 1919",,"A sketch of ""playgirls""","Ameen Rihani","Ameen Rihani Organization","Moise A. Khayrallah Center for Lebanese Diaspora Studies",1919,,"The donor retains full ownership of any copyright and rights currently controlled. Nonexclusive right to authorize uses of these materials for non-commercial research, scholarly, or other educational purposes are granted to Khayrallah Center pursuant to U.S. Copyright Law. Usage of the materials for these purposes must be fully credited with the source. The user assumes full responsibility for any use of the materials.",,Image/jpg,,Image,Rihani2019AR70_097,,,,,,,,,,,,,,,,,,,,,,,,,,,,,,,,,,,,,,,,,,,,,,,,,,,,,,,,,,,,,,,,,,,,,,,,,,,,,,"1910s,Art",https://lebanesestudies.omeka.chass.ncsu.edu/files/original/649e71cc4a7eee5b381b4518b21e2390.jpg,,"Ameen Rihani: Recordings, Photographs, and Drawings",1,0
87559,https://lebanesestudies.omeka.chass.ncsu.edu/items/show/87559,,,,,,,,,,,,,,,,,,,,,,,,,,,,,,,,,,,,,,,,,"Rihani Nude Sketches, 1919",,"A sketch of ""the unveiled nude""","Ameen Rihani","Ameen Rihani Organization","Moise A. Khayrallah Center for Lebanese Diaspora Studies",1919,,"The donor retains full ownership of any copyright and rights currently controlled. Nonexclusive right to authorize uses of these materials for non-commercial research, scholarly, or other educational purposes are granted to Khayrallah Center pursuant to U.S. Copyright Law. Usage of the materials for these purposes must be fully credited with the source. The user assumes full responsibility for any use of the materials.",,Image/jpg,,Image,Rihani2019AR70_098,,,,,,,,,,,,,,,,,,,,,,,,,,,,,,,,,,,,,,,,,,,,,,,,,,,,,,,,,,,,,,,,,,,,,,,,,,,,,,"1910s,Art",https://lebanesestudies.omeka.chass.ncsu.edu/files/original/c6a706c447a4362395b0533dc2597cfd.jpg,,"Ameen Rihani: Recordings, Photographs, and Drawings",1,0
82130,https://lebanesestudies.omeka.chass.ncsu.edu/items/show/82130,,,,,,,,,,,,,,,,,,,,,,,,,,,,,,,,,,,,,,,,,"Gladys Oussani Deed","Legal Documents","A deed certifying Gladys Oussani's sale to Joseph Oussani for $10 the listed properties, signed 11 June 1919.",,"Oussani Fuleihan family","Moise A. Khayrallah Center for Lebanese Diaspora Studies",1919,,"The donor retains full ownership of any copyright and rights currently controlled. Nonexclusive right to authorize uses of these materials for non-commercial research, scholarly, or other educational purposes are granted to Khayrallah Center pursuant to U.S. Copyright Law. Usage of the materials for these purposes must be fully credited with the source. The user assumes full responsibility for any use of the materials.",,Text/pdf,English,Text,Oussani2018-0328,,,,,,,,,,,,,,,,,,,,,,,,,,,,,,,,,,,,,,,,,,,,,,,,,,,,,,,,,,,,,,,,,,,,,,,,,,,,,,"1910s,Real Estate,Records",https://lebanesestudies.omeka.chass.ncsu.edu/files/original/f98b8f9b10ca06c82fb86257d81bccbb.pdf,,"Oussani and Fuleihan Family Papers Series 1: Documents",1,0
82129,https://lebanesestudies.omeka.chass.ncsu.edu/items/show/82129,,,,,,,,,,,,,,,,,,,,,,,,,,,,,,,,,,,,,,,,,"Catherine Oussani Eulogy",Obituaries,"A two page typed eulogy for the funeral of Mrs. Catherine Oussani.",,"Oussani Fuleihan family","Moise A. Khayrallah Center for Lebanese Diaspora Studies",1919,,"The donor retains full ownership of any copyright and rights currently controlled. Nonexclusive right to authorize uses of these materials for non-commercial research, scholarly, or other educational purposes are granted to Khayrallah Center pursuant to U.S. Copyright Law. Usage of the materials for these purposes must be fully credited with the source. The user assumes full responsibility for any use of the materials.",,Text/pdf,English,Text,Oussani2018-0329,,,,,,,,,,,,,,,,,,,,,,,,,,,,,,,,,,,,,,,,,,,,,,,,,,,,,,,,,,,,,,,,,,,,,,,,,,,,,,"1910s,Catholic Church,Obituaries",https://lebanesestudies.omeka.chass.ncsu.edu/files/original/e4ec1a907da26532a86469c64a5e5d6e.pdf,,"Oussani and Fuleihan Family Papers Series 1: Documents",1,0
82128,https://lebanesestudies.omeka.chass.ncsu.edu/items/show/82128,,,,,,,,,,,,,,,,,,,,,,,,,,,,,,,,,,,,,,,,,"Joseph and Gladys Oussani Divorce Contract","Legal Documents","A divorce contract defining property ownership between the separated couple, Joseph Oussani and Gladys Oussani, signed 13 August and 29 July 1919.",,"Oussani Fuleihan family","Moise A. Khayrallah Center for Lebanese Diaspora Studies",1919,,"The donor retains full ownership of any copyright and rights currently controlled. Nonexclusive right to authorize uses of these materials for non-commercial research, scholarly, or other educational purposes are granted to Khayrallah Center pursuant to U.S. Copyright Law. Usage of the materials for these purposes must be fully credited with the source. The user assumes full responsibility for any use of the materials.",,Text/pdf,English,Text,Oussani2018-0330,,,,,,,,,,,,,,,,,,,,,,,,,,,,,,,,,,,,,,,,,,,,,,,,,,,,,,,,,,,,,,,,,,,,,,,,,,,,,,"1910s,Law,Marriages,Real Estate,Records",https://lebanesestudies.omeka.chass.ncsu.edu/files/original/20c2646fc5e7a84c649663dcbed84c66.pdf,,"Oussani and Fuleihan Family Papers Series 1: Documents",1,0
82127,https://lebanesestudies.omeka.chass.ncsu.edu/items/show/82127,,,,,,,,,,,,,,,,,,,,,,,,,,,,,,,,,,,,,,,,,"Joseph Oussani Trust Department Note","Legal Documents","A bank note stating that Joseph Oussani will pay Gladys Oussani $1000 plus interest one year from that day, dated 15 August 1919. A written note on item states it was paid 16 August 1920. ",,"Oussani Fuleihan family","Moise A. Khayrallah Center for Lebanese Diaspora Studies",1919,,"The donor retains full ownership of any copyright and rights currently controlled. Nonexclusive right to authorize uses of these materials for non-commercial research, scholarly, or other educational purposes are granted to Khayrallah Center pursuant to U.S. Copyright Law. Usage of the materials for these purposes must be fully credited with the source. The user assumes full responsibility for any use of the materials.",,Text/pdf,,Text,Oussani2018-0331,,,,,,,,,,,,,,,,,,,,,,,,,,,,,,,,,,,,,,,,,,,,,,,,,,,,,,,,,,,,,,,,,,,,,,,,,,,,,,"1910s,Finance,Records",https://lebanesestudies.omeka.chass.ncsu.edu/files/original/1e794667fff05505e5394ece4f9ca1bc.pdf,,"Oussani and Fuleihan Family Papers Series 1: Documents",1,0
82126,https://lebanesestudies.omeka.chass.ncsu.edu/items/show/82126,,,,,,,,,,,,,,,,,,,,,,,,,,,,,,,,,,,,,,,,,"Bank Check from Joseph Oussani to Gladys Oussani","Legal Documents","A First National Bank of Fresno, California, bank check paid to the order of Gladys Oussani for $500 from Joseph Oussani dated 16 August 1919. ",,"Oussani Fuleihan family","Moise A. Khayrallah Center for Lebanese Diaspora Studies",1919,,"The donor retains full ownership of any copyright and rights currently controlled. Nonexclusive right to authorize uses of these materials for non-commercial research, scholarly, or other educational purposes are granted to Khayrallah Center pursuant to U.S. Copyright Law. Usage of the materials for these purposes must be fully credited with the source. The user assumes full responsibility for any use of the materials.",,Text/pdf,,Text,Oussani2018-0332,,,,,,,,,,,,,,,,,,,,,,,,,,,,,,,,,,,,,,,,,,,,,,,,,,,,,,,,,,,,,,,,,,,,,,,,,,,,,,"1910s,California,Finance,Records",https://lebanesestudies.omeka.chass.ncsu.edu/files/original/37c51a989849558197ed92f40c0b49dd.pdf,,"Oussani and Fuleihan Family Papers Series 1: Documents",1,0
82061,https://lebanesestudies.omeka.chass.ncsu.edu/items/show/82061,,,,,,,,,,,,,,,,,,,,,,,,,,,,,,,,,,,,,,,,,"""Anis Fuleihan Plays"" and ""Le Concert De Mr Fuleihan""","Newspapers^^ Music","Two articles from the New York Times labeled as November 20, 1919. The first is titled ""Anis Fuleihan Plays"" and the second, ""Le Concert de Mr. Fuleihan."" The first in English the second in French.","New York Times","Oussani Fuleihan family","Moise A. Khayrallah Center for Lebanese Diaspora Studies",1919,,"The donor retains full ownership of any copyright and rights currently controlled. Nonexclusive right to authorize uses of these materials for non-commercial research, scholarly, or other educational purposes are granted to Khayrallah Center pursuant to U.S. Copyright Law. Usage of the materials for these purposes must be fully credited with the source. The user assumes full responsibility for any use of the materials.",,Text/pdf,English,Text,Oussani2018-1072a,,,,,,,,,,,,,,,,,,,,,,,,,,,,,,,,,,,,,,,,,,,,,,,,,,,,,,,,,,,,,,,,,,,,,,,,,,,,,,"1910s,Music,New York,Newspapers",https://lebanesestudies.omeka.chass.ncsu.edu/files/original/e02cb9bdb7348ec08441149a2d2f9977.pdf,,"Oussani and Fuleihan Family Papers Series 1: Documents",1,0
82060,https://lebanesestudies.omeka.chass.ncsu.edu/items/show/82060,,,,,,,,,,,,,,,,,,,,,,,,,,,,,,,,,,,,,,,,,"Anis Fuleihan Debut Article","Newspapers^^ Music","Copy of a newspaper article, ""Anis Fuleihan Plays,"" from the New York Times advertising Anis Fuleihan's debut at 19 years old.","New York Times","Oussani Fuleihan family","Moise A. Khayrallah Center for Lebanese Diaspora Studies",1919,,"The donor retains full ownership of any copyright and rights currently controlled. Nonexclusive right to authorize uses of these materials for non-commercial research, scholarly, or other educational purposes are granted to Khayrallah Center pursuant to U.S. Copyright Law. Usage of the materials for these purposes must be fully credited with the source. The user assumes full responsibility for any use of the materials.",,Text/pdf,English,Text,Oussani2018-1073a,,,,,,,,,,,,,,,,,,,,,,,,,,,,,,,,,,,,,,,,,,,,,,,,,,,,,,,,,,,,,,,,,,,,,,,,,,,,,,"1910s,Music,New York,Newspapers",https://lebanesestudies.omeka.chass.ncsu.edu/files/original/9e06cba4ea66df4e1ccf9e8238f6ad22.pdf,,"Oussani and Fuleihan Family Papers Series 1: Documents",1,0
82059,https://lebanesestudies.omeka.chass.ncsu.edu/items/show/82059,,,,,,,,,,,,,,,,,,,,,,,,,,,,,,,,,,,,,,,,,"""Pianist Makes Debut""",Newspapers,"A newspaper article titled ""Pianist Makes Debut,"" describing Anis Fuleihan's debut in New York.",,"Oussani Fuleihan family","Moise A. Khayrallah Center for Lebanese Diaspora Studies",1919,,"The donor retains full ownership of any copyright and rights currently controlled. Nonexclusive right to authorize uses of these materials for non-commercial research, scholarly, or other educational purposes are granted to Khayrallah Center pursuant to U.S. Copyright Law. Usage of the materials for these purposes must be fully credited with the source. The user assumes full responsibility for any use of the materials.",,Text/pdf,English,Text,Oussani2018-1074a,,,,,,,,,,,,,,,,,,,,,,,,,,,,,,,,,,,,,,,,,,,,,,,,,,,,,,,,,,,,,,,,,,,,,,,,,,,,,,"1910s,Music,New York,Newspapers",https://lebanesestudies.omeka.chass.ncsu.edu/files/original/b15c8b9e544c40eaf6cfe00fc733786f.pdf,,"Oussani and Fuleihan Family Papers Series 1: Documents",1,0
82058,https://lebanesestudies.omeka.chass.ncsu.edu/items/show/82058,,,,,,,,,,,,,,,,,,,,,,,,,,,,,,,,,,,,,,,,,"Nasri Fuleihan British Nationality Certificate, 1919 July 31","Legal Documents","A Certificate of British Nationality for Nasri Fuleihan, Civil Engineer, dated 31 July 1919.",,"Oussani Fuleihan family","Moise A. Khayrallah Center for Lebanese Diaspora Studies",1919,,"The donor retains full ownership of any copyright and rights currently controlled. Nonexclusive right to authorize uses of these materials for non-commercial research, scholarly, or other educational purposes are granted to Khayrallah Center pursuant to U.S. Copyright Law. Usage of the materials for these purposes must be fully credited with the source. The user assumes full responsibility for any use of the materials.",,Text/pdf,English,Text,Oussani2018-1075,,,,,,,,,,,,,,,,,,,,,,,,,,,,,,,,,,,,,,,,,,,,,,,,,,,,,,,,,,,,,,,,,,,,,,,,,,,,,,"1910s,Citizenship,Great Britain,Occupations-Engineer,Records",https://lebanesestudies.omeka.chass.ncsu.edu/files/original/656789769be1b98a6c72633491259585.pdf,,"Oussani and Fuleihan Family Papers Series 1: Documents",1,0
78516,https://lebanesestudies.omeka.chass.ncsu.edu/items/show/78516,"Correspondence 133-330 Volume 195",,,,,,,,,,,,,,,,,,,,,,,,,,,,,,,,,,,,,,"National Archives Record Group 84 Records of the Foreign Service Posts of the Department of State",,"Beirut Consulate Record Book Vol. 195 Part 1","Consulates^^ Correspondence","A bound volume containing correspondence from 1919 concerning births and marriages (certificates, notifications, baptism info, etc.), Americans settling the affairs of recently deceased family members in Lebanon (debts, inheritance, etc), getting travel affairs in order to leave Lebanon/Syria, welfare reports, and papers certifying citizenship. The volume contains both handwritten and typewritten records and is partially searchable by OCR.","Department of State^^ U.S. Consulate General, Beirut","National Archives","Moise A. Khayrallah Center for Lebanese Diaspora Studies",1919,,"The donor retains full ownership of any copyright and rights currently controlled. Nonexclusive right to authorize uses of these materials for non-commercial research, scholarly, or other educational purposes are granted to Khayrallah Center pursuant to U.S. Copyright Law. Usage of the materials for these purposes must be fully credited with the source. The user assumes full responsibility for any use of the materials.",,Text/pdf,"Arabic^^ English^^ French",Text,Beirut_Consulate195_RG84_NARASM_Part1OCRWM,"Beirut, Lebanon",,,,,,,,,,,,,,,,,,,,,,,,,,,,,,,,,,,,,,,,,,,,,,,,,,,,,,,,,,,,,,,,,,,,,,,,,,,,,"1910s,Beirut,Citizenship,Correspondence,Embassies,Records,Travel",https://lebanesestudies.omeka.chass.ncsu.edu/files/original/4cdfff10ca4acde29c3fc068ad57541e.pdf,,"Beirut Consulate Post Records Collection",1,0
78515,https://lebanesestudies.omeka.chass.ncsu.edu/items/show/78515,"Correspondence 133-330 Volume 195",,,,,,,,,,,,,,,,,,,,,,,,,,,,,,,,,,,,,,"National Archives Record Group 84 Records of the Foreign Service Posts of the Department of State",,"Beirut Consulate Record Book Vol. 195 Part 2","Consulates^^ Correspondence","A bound volume containing correspondence from 1919 concerning births and marriages (certificates, notifications, baptism info, etc.), Americans settling the affairs of recently deceased family members in Lebanon (debts, inheritance, etc), getting travel affairs in order to leave Lebanon/Syria, welfare reports, and papers certifying citizenship. The volume contains both handwritten and typewritten records and is partially searchable by OCR.","Department of State^^ U.S. Consulate General, Beirut","National Archives","Moise A. Khayrallah Center for Lebanese Diaspora Studies",1919,,"The donor retains full ownership of any copyright and rights currently controlled. Nonexclusive right to authorize uses of these materials for non-commercial research, scholarly, or other educational purposes are granted to Khayrallah Center pursuant to U.S. Copyright Law. Usage of the materials for these purposes must be fully credited with the source. The user assumes full responsibility for any use of the materials.",,Text/pdf,"Arabic^^ English^^ French",Text,Beirut_Consulate195_RG84_NARASM_Part2OCRWM,"Beirut, Lebanon",,,,,,,,,,,,,,,,,,,,,,,,,,,,,,,,,,,,,,,,,,,,,,,,,,,,,,,,,,,,,,,,,,,,,,,,,,,,,"1910s,Beirut,Citizenship,Correspondence,Embassies,Records,Travel",https://lebanesestudies.omeka.chass.ncsu.edu/files/original/0e5ce8aa12576213a0c861ad391e78a2.pdf,,"Beirut Consulate Post Records Collection",1,0
78514,https://lebanesestudies.omeka.chass.ncsu.edu/items/show/78514,"Correspondence 133-330 Volume 195",,,,,,,,,,,,,,,,,,,,,,,,,,,,,,,,,,,,,,"National Archives Record Group 84 Records of the Foreign Service Posts of the Department of State",,"Beirut Consulate Record Book Vol. 195 Part 3","Consulates^^ Correspondence","A bound volume containing correspondence from 1919 concerning births and marriages (certificates, notifications, baptism info, etc.), Americans settling the affairs of recently deceased family members in Lebanon (debts, inheritance, etc), getting travel affairs in order to leave Lebanon/Syria, welfare reports, and papers certifying citizenship. The volume contains both handwritten and typewritten records and is partially searchable by OCR.","Department of State^^ U.S. Consulate General, Beirut","National Archives","Moise A. Khayrallah Center for Lebanese Diaspora Studies",1919,,"The donor retains full ownership of any copyright and rights currently controlled. Nonexclusive right to authorize uses of these materials for non-commercial research, scholarly, or other educational purposes are granted to Khayrallah Center pursuant to U.S. Copyright Law. Usage of the materials for these purposes must be fully credited with the source. The user assumes full responsibility for any use of the materials.",,Text/pdf,"Arabic^^ English^^ French",Text,Beirut_Consulate195_RG84_NARASM_Part3OCRWM,"Beirut, Lebanon",,,,,,,,,,,,,,,,,,,,,,,,,,,,,,,,,,,,,,,,,,,,,,,,,,,,,,,,,,,,,,,,,,,,,,,,,,,,,"1910s,Beirut,Citizenship,Correspondence,Embassies,Records,Travel",https://lebanesestudies.omeka.chass.ncsu.edu/files/original/4387f737d448db11c3026c80c30daa31.pdf,,"Beirut Consulate Post Records Collection",1,0
78513,https://lebanesestudies.omeka.chass.ncsu.edu/items/show/78513,"Correspondence 133-330 Volume 195",,,,,,,,,,,,,,,,,,,,,,,,,,,,,,,,,,,,,,"National Archives Record Group 84 Records of the Foreign Service Posts of the Department of State",,"Beirut Consulate Record Book Vol. 195 Part 4","Consulates^^ Correspondence","A bound volume containing correspondence from 1919 concerning births and marriages (certificates, notifications, baptism info, etc.), Americans settling the affairs of recently deceased family members in Lebanon (debts, inheritance, etc), getting travel affairs in order to leave Lebanon/Syria, welfare reports, and papers certifying citizenship. The volume contains both handwritten and typewritten records and is partially searchable by OCR.","Department of State^^ U.S. Consulate General, Beirut","National Archives","Moise A. Khayrallah Center for Lebanese Diaspora Studies",1919,,"The donor retains full ownership of any copyright and rights currently controlled. Nonexclusive right to authorize uses of these materials for non-commercial research, scholarly, or other educational purposes are granted to Khayrallah Center pursuant to U.S. Copyright Law. Usage of the materials for these purposes must be fully credited with the source. The user assumes full responsibility for any use of the materials.",,Text/pdf,"Arabic^^ English^^ French",Text,Beirut_Consulate195_RG84_NARASM_Part4OCRWM,"Beirut, Lebanon",,,,,,,,,,,,,,,,,,,,,,,,,,,,,,,,,,,,,,,,,,,,,,,,,,,,,,,,,,,,,,,,,,,,,,,,,,,,,"1910s,Beirut,Citizenship,Correspondence,Embassies,Records,Travel",https://lebanesestudies.omeka.chass.ncsu.edu/files/original/ad398e288fb769149ab28cc4e874b8e4.pdf,,"Beirut Consulate Post Records Collection",1,0