﻿"Item Id","Item URI","Dublin Core:Alternative Title","Dublin Core:Abstract","Dublin Core:Table Of Contents","Dublin Core:Date Available","Dublin Core:Date Created","Dublin Core:Date Accepted","Dublin Core:Date Copyrighted","Dublin Core:Date Submitted","Dublin Core:Date Issued","Dublin Core:Date Modified","Dublin Core:Date Valid","Dublin Core:Access Rights","Dublin Core:License","Dublin Core:Conforms To","Dublin Core:Has Format","Dublin Core:Has Part","Dublin Core:Has Version","Dublin Core:Is Format Of","Dublin Core:Is Part Of","Dublin Core:Is Referenced By","Dublin Core:Is Replaced By","Dublin Core:Is Required By","Dublin Core:Is Version Of","Dublin Core:References","Dublin Core:Replaces","Dublin Core:Requires","Dublin Core:Extent","Dublin Core:Medium","Dublin Core:Bibliographic Citation","Dublin Core:Spatial Coverage","Dublin Core:Temporal Coverage","Dublin Core:Accrual Method","Dublin Core:Accrual Periodicity","Dublin Core:Accrual Policy","Dublin Core:Audience","Dublin Core:Audience Education Level","Dublin Core:Mediator","Dublin Core:Instructional Method","Dublin Core:Provenance","Dublin Core:Rights Holder","Dublin Core:Title","Dublin Core:Subject","Dublin Core:Description","Dublin Core:Creator","Dublin Core:Source","Dublin Core:Publisher","Dublin Core:Date","Dublin Core:Contributor","Dublin Core:Rights","Dublin Core:Relation","Dublin Core:Format","Dublin Core:Language","Dublin Core:Type","Dublin Core:Identifier","Dublin Core:Coverage","Item Type Metadata:Text","Item Type Metadata:Interviewer","Item Type Metadata:Interviewee","Item Type Metadata:Location","Item Type Metadata:Transcription","Item Type Metadata:Local URL","Item Type Metadata:Original Format","Item Type Metadata:Physical Dimensions","Item Type Metadata:Duration","Item Type Metadata:Compression","Item Type Metadata:Producer","Item Type Metadata:Director","Item Type Metadata:Bit Rate/Frequency","Item Type Metadata:Time Summary","Item Type Metadata:Email Body","Item Type Metadata:Subject Line","Item Type Metadata:From","Item Type Metadata:To","Item Type Metadata:CC","Item Type Metadata:BCC","Item Type Metadata:Number of Attachments","Item Type Metadata:Standards","Item Type Metadata:Objectives","Item Type Metadata:Materials","Item Type Metadata:Lesson Plan Text","Item Type Metadata:URL","Item Type Metadata:Event Type","Item Type Metadata:Participants","Item Type Metadata:Birth Date","Item Type Metadata:Birthplace","Item Type Metadata:Death Date","Item Type Metadata:Occupation","Item Type Metadata:Biographical Text","Item Type Metadata:Bibliography","Item Type Metadata:First Name (English)","Item Type Metadata:Last Name (English)","Item Type Metadata:Address","Item Type Metadata:City","Item Type Metadata:State","Item Type Metadata:Business (English)","Item Type Metadata:Provenance (English)","Item Type Metadata:Provenance (Arabic)","Item Type Metadata:Business (Arabic)","Item Type Metadata:Last Name (Arabic)","Item Type Metadata:First Name (Arabic)","Item Type Metadata:Player","Omeka Legacy File:Additional Creator","Omeka Legacy File:Transcriber","Omeka Legacy File:Producer","Omeka Legacy File:Render Device","Omeka Legacy File:Render Details","Omeka Legacy File:Capture Date","Omeka Legacy File:Capture Device","Omeka Legacy File:Capture Details","Omeka Legacy File:Change History","Omeka Legacy File:Watermark","Omeka Legacy File:Encryption","Omeka Legacy File:Compression","Omeka Legacy File:Post Processing","Omeka Image File:Width","Omeka Image File:Height","Omeka Image File:Bit Depth","Omeka Image File:Channels","Omeka Image File:Exif String","Omeka Image File:Exif Array","Omeka Image File:IPTC String","Omeka Image File:IPTC Array","Omeka Video File:Bitrate","Omeka Video File:Duration","Omeka Video File:Sample Rate","Omeka Video File:Codec","Omeka Video File:Width","Omeka Video File:Height","PDF Text:Text","Users Elements:Test","Test Elements:Test",tags,file,itemType,collection,public,featured
82065,https://lebanesestudies.omeka.chass.ncsu.edu/items/show/82065,,,,,,,,,,,,,,,,,,,,,,,,,,,,,,,,,,,,,,,,,"Sailboat Drawing by Micky Fuleihan, 1914",Drawing,"A drawing of a sailboat with color, dated 1914.","Anis Fuleihan","Oussani Fuleihan family","Moise A. Khayrallah Center for Lebanese Diaspora Studies",1914,,"The donor retains full ownership of any copyright and rights currently controlled. Nonexclusive right to authorize uses of these materials for non-commercial research, scholarly, or other educational purposes are granted to Khayrallah Center pursuant to U.S. Copyright Law. Usage of the materials for these purposes must be fully credited with the source. The user assumes full responsibility for any use of the materials.",,Image/pdf,English,Image,Oussani2018-1068,,,,,,,,,,,,,,,,,,,,,,,,,,,,,,,,,,,,,,,,,,,,,,,,,,,,,,,,,,,,,,,,,,,,,,,,,,,,,,"1910s,Art",https://lebanesestudies.omeka.chass.ncsu.edu/files/original/96956f905aa6053b14953ac4d38c9897.pdf,,"Oussani and Fuleihan Family Papers Series 1: Documents",1,0
43901,https://lebanesestudies.omeka.chass.ncsu.edu/items/show/43901,,,,,,,,,,,,,,,,,,,,,,,,,,,,,,,,,,,,,,,,,"Letter from Anis Fuleihan to Ameen Rihani, 1919 November 29","Rihani, Ameen Fares, 1876-1940^^ Letter writing, English^^ Correspondence^^ American literature--Arab American authors","A letter from Anis Fuleihan to Ameen Rihani, dated November 29, 1919.","Anis Fuleihan","Ameen Rihani Organization","Moise A. Khayrallah Center for Lebanese Diaspora Studies",1919-11-29,,"Donor retains full ownership of any and all copyright currently controlled in agreement with Khayrallah Center. Nonexclusive right to authorize all uses of these materials for non-commercial research, scholarly, or other educational purposes are granted to Khayrallah Center pursuant to Creative Commons Attribution-NonCommercial-ShareAlike (CC BY-NC-SA).",,Text/pdf,English,Text,Rihani2019AR18_F_141,"Greenwich, New York",,,,,,,,,,,,,,,,,,,,,,,,,,,,,,,,,,,,,,,,,,,,,,,,,,,,,,,,,,,,,,,,,,,,,,,,,,,,,"1910's,Anis Fuleihan",https://lebanesestudies.omeka.chass.ncsu.edu/files/original/54a3899960c5a33e9d74174a19097b1c.pdf,,"Ameen Rihani: English Letters",1,0
82057,https://lebanesestudies.omeka.chass.ncsu.edu/items/show/82057,,,,,,,,,,,,,,,,,,,,,,,,,,,,,,,,,,,,,,,,,"Sailboat Drawing by Micky Fuleihan, 1920",Drawing,"A drawing of a sailboat with color, dated 1920.","Anis Fuleihan","Oussani Fuleihan family","Moise A. Khayrallah Center for Lebanese Diaspora Studies",1920,,"The donor retains full ownership of any copyright and rights currently controlled. Nonexclusive right to authorize uses of these materials for non-commercial research, scholarly, or other educational purposes are granted to Khayrallah Center pursuant to U.S. Copyright Law. Usage of the materials for these purposes must be fully credited with the source. The user assumes full responsibility for any use of the materials.",,Image/pdf,English,Image,Oussani2018-1076,,,,,,,,,,,,,,,,,,,,,,,,,,,,,,,,,,,,,,,,,,,,,,,,,,,,,,,,,,,,,,,,,,,,,,,,,,,,,,"1920s,Art",https://lebanesestudies.omeka.chass.ncsu.edu/files/original/0b66fd228a584a838a4edec2f1c84716.pdf,,"Oussani and Fuleihan Family Papers Series 1: Documents",1,0
43935,https://lebanesestudies.omeka.chass.ncsu.edu/items/show/43935,,,,,,,,,,,,,,,,,,,,,,,,,,,,,,,,,,,,,,,,,"Letter from Anis Fuleihan to Ameen Rihani, 1921 May 9","Rihani, Ameen Fares, 1876-1940^^ Letter writing, English^^ Correspondence^^ American literature--Arab American authors","A letter from Anis Fuleihan to Ameen Rihani, dated May 9, 1921. ","Anis Fuleihan","Ameen Rihani Organization","Moise A. Khayrallah Center for Lebanese Diaspora Studies",1921-05-09,,"Donor retains full ownership of any and all copyright currently controlled in agreement with Khayrallah Center. Nonexclusive right to authorize all uses of these materials for non-commercial research, scholarly, or other educational purposes are granted to Khayrallah Center pursuant to Creative Commons Attribution-NonCommercial-ShareAlike (CC BY-NC-SA).",,Text/pdf,"English ",Text,Rihani2019AR18_F_083,"Brooklyn, New York",,,,,,,,,,,,,,,,,,,,,,,,,,,,,,,,,,,,,,,,,,,,,,,,,,,,,,,,,,,,,,,,,,,,,,,,,,,,,"1920's,Anis Fuleihan",https://lebanesestudies.omeka.chass.ncsu.edu/files/original/8266912f6c7ded37a788082e8e1bb523.pdf,,"Ameen Rihani: English Letters",1,0
82029,https://lebanesestudies.omeka.chass.ncsu.edu/items/show/82029,,,,,,,,,,,,,,,,,,,,,,,,,,,,,,,,,,,,,,,,,"Letter from Anis Fuleihan to Henry Allen Moe, 1943 January 12","Music^^ Correspondence","A letter to Mr. Moe from Anis Fuleihan regarding a fellowship in music composition, dated 12 Jan 1943.","Anis Fuleihan","Oussani Fuleihan family","Moise A. Khayrallah Center for Lebanese Diaspora Studies","1943 January 12",,"The donor retains full ownership of any copyright and rights currently controlled. Nonexclusive right to authorize uses of these materials for non-commercial research, scholarly, or other educational purposes are granted to Khayrallah Center pursuant to U.S. Copyright Law. Usage of the materials for these purposes must be fully credited with the source. The user assumes full responsibility for any use of the materials.",,Text/pdf,English,Text,Oussani2018-1104,,,,,,,,,,,,,,,,,,,,,,,,,,,,,,,,,,,,,,,,,,,,,,,,,,,,,,,,,,,,,,,,,,,,,,,,,,,,,,"1940s,Education,Letters-English,Music",https://lebanesestudies.omeka.chass.ncsu.edu/files/original/37047903293e0592ea3ef7c4e12bea5c.pdf,,"Oussani and Fuleihan Family Papers Series 1: Documents",1,0
82030,https://lebanesestudies.omeka.chass.ncsu.edu/items/show/82030,,,,,,,,,,,,,,,,,,,,,,,,,,,,,,,,,,,,,,,,,"Letter from Anis Fuleihan to Henry Allen Moe, 1943 January 12","Music^^ Correspondence","A photocopy of a letter to Mr. Moe from Anis Fuleihan regarding a fellowship in music composition, dated 12 Jan 1943.","Anis Fuleihan","Oussani Fuleihan family","Moise A. Khayrallah Center for Lebanese Diaspora Studies","1943 January 12",,"The donor retains full ownership of any copyright and rights currently controlled. Nonexclusive right to authorize uses of these materials for non-commercial research, scholarly, or other educational purposes are granted to Khayrallah Center pursuant to U.S. Copyright Law. Usage of the materials for these purposes must be fully credited with the source. The user assumes full responsibility for any use of the materials.",,Text/pdf,English,Text,Oussani2018-1103,,,,,,,,,,,,,,,,,,,,,,,,,,,,,,,,,,,,,,,,,,,,,,,,,,,,,,,,,,,,,,,,,,,,,,,,,,,,,,"1940s,Education,Letters-English,Music",https://lebanesestudies.omeka.chass.ncsu.edu/files/original/edc1b279e5e2d57e292ea29a64112ef3.pdf,,"Oussani and Fuleihan Family Papers Series 1: Documents",1,0
82031,https://lebanesestudies.omeka.chass.ncsu.edu/items/show/82031,,,,,,,,,,,,,,,,,,,,,,,,,,,,,,,,,,,,,,,,,"Letter from Anis Fuleihan to Henry Allen Moe, 1943 January 12","Music^^ Correspondence","A letter to Mr. Moe from Anis Fuleihan regarding a fellowship in music composition, dated 12 Jan 1943.","Anis Fuleihan","Oussani Fuleihan family","Moise A. Khayrallah Center for Lebanese Diaspora Studies","1943 January 12",,"The donor retains full ownership of any copyright and rights currently controlled. Nonexclusive right to authorize uses of these materials for non-commercial research, scholarly, or other educational purposes are granted to Khayrallah Center pursuant to U.S. Copyright Law. Usage of the materials for these purposes must be fully credited with the source. The user assumes full responsibility for any use of the materials.",,Text/pdf,English,Text,Oussani2018-1102,,,,,,,,,,,,,,,,,,,,,,,,,,,,,,,,,,,,,,,,,,,,,,,,,,,,,,,,,,,,,,,,,,,,,,,,,,,,,,"1940s,Education,Letters-English,Music",https://lebanesestudies.omeka.chass.ncsu.edu/files/original/0ba166d066c3bd09b18b1acb2bed8646.pdf,,"Oussani and Fuleihan Family Papers Series 1: Documents",1,0
82016,https://lebanesestudies.omeka.chass.ncsu.edu/items/show/82016,,,,,,,,,,,,,,,,,,,,,,,,,,,,,,,,,,,,,,,,,"Letter from Anis Fuleihan to Dorothy Fuleihan, 1949 November 1","Correspondence^^ Education","A letter from Anis Fuleihan at Indiana University to Dorothy 'Dot' Fuleihan in Bronx, NY, postmarked 1 November 1949.","Anis Fuleihan","Oussani Fuleihan family","Moise A. Khayrallah Center for Lebanese Diaspora Studies","1949 November 01",,"The donor retains full ownership of any copyright and rights currently controlled. Nonexclusive right to authorize uses of these materials for non-commercial research, scholarly, or other educational purposes are granted to Khayrallah Center pursuant to U.S. Copyright Law. Usage of the materials for these purposes must be fully credited with the source. The user assumes full responsibility for any use of the materials.",,Text/pdf,English,Text,Oussani2018-1117,,,,,,,,,,,,,,,,,,,,,,,,,,,,,,,,,,,,,,,,,,,,,,,,,,,,,,,,,,,,,,,,,,,,,,,,,,,,,,"1940s,Indiana,Letters-English,New York",https://lebanesestudies.omeka.chass.ncsu.edu/files/original/f4dd2b3e12a5aab6ae9e01a902f3e455.pdf,,"Oussani and Fuleihan Family Papers Series 1: Documents",1,0
82010,https://lebanesestudies.omeka.chass.ncsu.edu/items/show/82010,,,,,,,,,,,,,,,,,,,,,,,,,,,,,,,,,,,,,,,,,"Anis Fuleihan American University Letter","Education^^ Correspondence","A letter from Anis Fuleihan at American University in Beirut, Lebanon, to Frank and Dorothy O'Keefe in Bronxville, NY.","Anis Fuleihan","Oussani Fuleihan family","Moise A. Khayrallah Center for Lebanese Diaspora Studies",1953,,"The donor retains full ownership of any copyright and rights currently controlled. Nonexclusive right to authorize uses of these materials for non-commercial research, scholarly, or other educational purposes are granted to Khayrallah Center pursuant to U.S. Copyright Law. Usage of the materials for these purposes must be fully credited with the source. The user assumes full responsibility for any use of the materials.",,Text/pdf,English,Text,Oussani2018-1123,,,,,,,,,,,,,,,,,,,,,,,,,,,,,,,,,,,,,,,,,,,,,,,,,,,,,,,,,,,,,,,,,,,,,,,,,,,,,,"1950s,American University of Beirut,Education,Lebanon,Letters-English,New York",https://lebanesestudies.omeka.chass.ncsu.edu/files/original/d10cb900e72ae735788e9e20a5f18573.pdf,,"Oussani and Fuleihan Family Papers Series 1: Documents",1,0
