﻿"Item Id","Item URI","Dublin Core:Alternative Title","Dublin Core:Abstract","Dublin Core:Table Of Contents","Dublin Core:Date Available","Dublin Core:Date Created","Dublin Core:Date Accepted","Dublin Core:Date Copyrighted","Dublin Core:Date Submitted","Dublin Core:Date Issued","Dublin Core:Date Modified","Dublin Core:Date Valid","Dublin Core:Access Rights","Dublin Core:License","Dublin Core:Conforms To","Dublin Core:Has Format","Dublin Core:Has Part","Dublin Core:Has Version","Dublin Core:Is Format Of","Dublin Core:Is Part Of","Dublin Core:Is Referenced By","Dublin Core:Is Replaced By","Dublin Core:Is Required By","Dublin Core:Is Version Of","Dublin Core:References","Dublin Core:Replaces","Dublin Core:Requires","Dublin Core:Extent","Dublin Core:Medium","Dublin Core:Bibliographic Citation","Dublin Core:Spatial Coverage","Dublin Core:Temporal Coverage","Dublin Core:Accrual Method","Dublin Core:Accrual Periodicity","Dublin Core:Accrual Policy","Dublin Core:Audience","Dublin Core:Audience Education Level","Dublin Core:Mediator","Dublin Core:Instructional Method","Dublin Core:Provenance","Dublin Core:Rights Holder","Dublin Core:Title","Dublin Core:Subject","Dublin Core:Description","Dublin Core:Creator","Dublin Core:Source","Dublin Core:Publisher","Dublin Core:Date","Dublin Core:Contributor","Dublin Core:Rights","Dublin Core:Relation","Dublin Core:Format","Dublin Core:Language","Dublin Core:Type","Dublin Core:Identifier","Dublin Core:Coverage","Item Type Metadata:Text","Item Type Metadata:Interviewer","Item Type Metadata:Interviewee","Item Type Metadata:Location","Item Type Metadata:Transcription","Item Type Metadata:Local URL","Item Type Metadata:Original Format","Item Type Metadata:Physical Dimensions","Item Type Metadata:Duration","Item Type Metadata:Compression","Item Type Metadata:Producer","Item Type Metadata:Director","Item Type Metadata:Bit Rate/Frequency","Item Type Metadata:Time Summary","Item Type Metadata:Email Body","Item Type Metadata:Subject Line","Item Type Metadata:From","Item Type Metadata:To","Item Type Metadata:CC","Item Type Metadata:BCC","Item Type Metadata:Number of Attachments","Item Type Metadata:Standards","Item Type Metadata:Objectives","Item Type Metadata:Materials","Item Type Metadata:Lesson Plan Text","Item Type Metadata:URL","Item Type Metadata:Event Type","Item Type Metadata:Participants","Item Type Metadata:Birth Date","Item Type Metadata:Birthplace","Item Type Metadata:Death Date","Item Type Metadata:Occupation","Item Type Metadata:Biographical Text","Item Type Metadata:Bibliography","Item Type Metadata:First Name (English)","Item Type Metadata:Last Name (English)","Item Type Metadata:Address","Item Type Metadata:City","Item Type Metadata:State","Item Type Metadata:Business (English)","Item Type Metadata:Provenance (English)","Item Type Metadata:Provenance (Arabic)","Item Type Metadata:Business (Arabic)","Item Type Metadata:Last Name (Arabic)","Item Type Metadata:First Name (Arabic)","Item Type Metadata:Player","Omeka Legacy File:Additional Creator","Omeka Legacy File:Transcriber","Omeka Legacy File:Producer","Omeka Legacy File:Render Device","Omeka Legacy File:Render Details","Omeka Legacy File:Capture Date","Omeka Legacy File:Capture Device","Omeka Legacy File:Capture Details","Omeka Legacy File:Change History","Omeka Legacy File:Watermark","Omeka Legacy File:Encryption","Omeka Legacy File:Compression","Omeka Legacy File:Post Processing","Omeka Image File:Width","Omeka Image File:Height","Omeka Image File:Bit Depth","Omeka Image File:Channels","Omeka Image File:Exif String","Omeka Image File:Exif Array","Omeka Image File:IPTC String","Omeka Image File:IPTC Array","Omeka Video File:Bitrate","Omeka Video File:Duration","Omeka Video File:Sample Rate","Omeka Video File:Codec","Omeka Video File:Width","Omeka Video File:Height","PDF Text:Text","Users Elements:Test","Test Elements:Test",tags,file,itemType,collection,public,featured
11973,https://lebanesestudies.omeka.chass.ncsu.edu/items/show/11973,,,,,,,,,,,,,,,,,,,,,,,,,,,,,,,,,,,,,,,,,"""Joe El Khouri Speaks on Lebanon to Agayah Club""","Periodicals^^Public Speaking--Relations--Foreign Countries^^Civic Leaders--North Carolina","An article in The Graham Star concerning Joseph El-Khouri's speech given to a local club about issues in Lebanon and North Carolina. (Folder 12-21)","The Graham Star","Marsha El-Khouri Shiver","Moise A. Khayrallah Center for Lebanese Diaspora Studies","August 12, 1977",,"Donor retains full ownership of any and all copyright currently controlled in agreement with Khayrallah Center. Nonexclusive right to authorize all uses of these materials for non-commercial research, scholarly, or other educational purposes are granted to Khayrallah Center pursuant to Creative Commons Attribution-NonCommercial-ShareAlike (CC BY-NC-SA).",,Text/jpg,English,Text,"2016 12-21",,,,,,,,Newspaper,,,,,,,,,,,,,,,,,,,,,,,,,,,,,,,,,,,,,,,,,,,,,,,,,,,,,,,,,,,,,,,,,,,,,,"1970's,El-Khouri,Joseph El-Khouri,Lebanese Civil War,Lebanon,Lion's Club International,Public Service,The Graham Star",https://lebanesestudies.omeka.chass.ncsu.edu/files/original/d67ecca864ff912454e4c215d4addd85.tif,Document,"El-Khouri Family",1,0
11893,https://lebanesestudies.omeka.chass.ncsu.edu/items/show/11893,,,,,,,,,,,,,,,,,,,,,,,,,,,,,,,,,,,,,,,,,"""Joe El-Khouri Gets Things Done""",Periodicals,"An article in the Asheville Citizen-Times about Joseph El-Khouri's biography and public service. Attached was a business card for the Advertising Manager at the Asheville Citizen-Times. (Folder 12-13)","Bob Terrell","Marsha El-Khouri Shiver","Moise A. Khayrallah Center for Lebanese Diaspora Studies","October 26, 1971",,"Donor retains full ownership of any and all copyright currently controlled in agreement with Khayrallah Center. Nonexclusive right to authorize all uses of these materials for non-commercial research, scholarly, or other educational purposes are granted to Khayrallah Center pursuant to Creative Commons Attribution-NonCommercial-ShareAlike (CC BY-NC-SA).",,Text/pdf,English,Text,"2016 12-13",,,,,,,,Newspaper,,,,,,,,,,,,,,,,,,,,,,,,,,,,,,,,,,,,,,,,,,,,,,,,,,,,,,,,,,,,,,,,,,,,,,"1970's,Asheville Citizen-Times,Biographies,El-Khouri,Hubert Humphrey,Humphrey,Joseph El-Khouri,Newspapers,North Carolina",https://lebanesestudies.omeka.chass.ncsu.edu/files/original/a3c011b094b600ef670d253a49fedf24.pdf,Document,"El-Khouri Family",1,0
11884,https://lebanesestudies.omeka.chass.ncsu.edu/items/show/11884,,,,,,,,,,,,,,,,,,,,,,,,,,,,,,,,,,,,,,,,,"""Joe El-Khouri, A Man of Community Involvement""",,"An article from the Andrews Journal about Joseph El-Khouri and his role in the community. (Folder 12-4)","The Andrews Journal","Marsha El-Khouri Shiver","Moise A. Khayrallah Center for Lebanese Diaspora Studies","October 22, 1987",,"Donor retains full ownership of any and all copyright currently controlled in agreement with Khayrallah Center. Nonexclusive right to authorize all uses of these materials for non-commercial research, scholarly, or other educational purposes are granted to Khayrallah Center pursuant to Creative Commons Attribution-NonCommercial-ShareAlike (CC BY-NC-SA).",,Text/pdf,English,Text,"2016 12-04",,,,,,,,Newspaper,,,,,,,,,,,,,,,,,,,,,,,,,,,,,,,,,,,,,,,,,,,,,,,,,,,,,,,,,,,,,,,,,,,,,,"1980's,Andrews, North Carolina,Biographical Notes,Catholic Church,Community Service,Democratic Executive Committee,El-Khouri,Joseph El-Khouri,Khouri's Department Store,Lion's Club International,Newspapers,The Andrews Journal,Volunteering",https://lebanesestudies.omeka.chass.ncsu.edu/files/original/b222be7f988dc347a0eb004e174fa467.pdf,Document,"El-Khouri Family",1,1
11989,https://lebanesestudies.omeka.chass.ncsu.edu/items/show/11989,,,,,,,,,,,,,,,,,,,,,,,,,,,,,,,,,,,,,,,,,"""Joe El-Khouri's Thoughts have Turned Lately to his Homeland, Shocking Ellis Island Stop""",Periodicals^^Biographies,"An article published by the Asheville Citizen-Times concerning Joseph El-Khouri's immigration to the United States. (Folder 12-38)","Phyllis Cooley","Marsha El-Khouri Shiver","Moise A. Khayrallah Center for Lebanese Diaspora Studies","October 31, 1990",,"Donor retains full ownership of any and all copyright currently controlled in agreement with Khayrallah Center. Nonexclusive right to authorize all uses of these materials for non-commercial research, scholarly, or other educational purposes are granted to Khayrallah Center pursuant to Creative Commons Attribution-NonCommercial-ShareAlike (CC BY-NC-SA).",,Text/jpg,English,Text,"2016 12-38",,,,,,,,Newspaper,,,,,,,,,,,,,,,,,,,,,,,,,,,,,,,,,,,,,,,,,,,,,,,,,,,,,,,,,,,,,,,,,,,,,,"Asheville Citizen-Times,Biographies,El-Khouri,Ellis Island,Immigration,Joseph El-Khouri,Lebanon",https://lebanesestudies.omeka.chass.ncsu.edu/files/original/620d634af994e8ba76986ddfda5bcf36.tif,Document,"El-Khouri Family",1,0
1033,https://lebanesestudies.omeka.chass.ncsu.edu/items/show/1033,,,,,,,,,,,,,,,,,,,,,,,,,,,,,,,,,,,,,,,,,"""Joe Simon, the Syrian-merchant, has purchased..."" 1903",,,"The Wilmington Messenger","Special Collections Department, North Carolina Room, New Hanover County Public Library, Wilmington, North Carolina","The Wilmington Messenger^^Moise A. Khayrallah Center for Lebanese Diaspora Studies","October 13, 1903",,"Donor retains full ownership of any and all copyright currently controlled in agreement with Khayrallah Center. Nonexclusive right to authorize all uses of these materials for non-commercial research, scholarly, or other educational purposes are granted to Khayrallah Center pursuant to Creative Commons Attribution-NonCommercial-ShareAlike (CC BY-NC-SA).",,,English,,,,,,,,,,,,,,,,,,,,,,,,,,,,,,,,,,,,,,,,,,,,,,,,,,,,,,,,,,,,,,,,,,,,,,,,,,,,,,,,"1900's,Joe Simon,Merchant,Newspapers,Newspapers-Wilmington,North Carolina,S. & B. Solomon,Simon,Stock,Wilmington, North Carolina",https://lebanesestudies.omeka.chass.ncsu.edu/files/original/143fe893080d77925b36b660bf9e8347.jpg,Newspaper,"North Carolina Newspapers",1,1
1038,https://lebanesestudies.omeka.chass.ncsu.edu/items/show/1038,,,,,,,,,,,,,,,,,,,,,,,,,,,,,,,,,,,,,,,,,"""Jos. Simon, a Syrian merchant, has rented of Mr. A. D. Wessell..."" 1899",,,"The News Dispatch","Special Collections Department, North Carolina Room, New Hanover County Public Library, Wilmington, North Carolina","""The News Dispatch""^^Moise A. Khayrallah Center for Lebanese Diaspora Studies","August 18, 1899",,"Donor retains full ownership of any and all copyright currently controlled in agreement with Khayrallah Center. Nonexclusive right to authorize all uses of these materials for non-commercial research, scholarly, or other educational purposes are granted to Khayrallah Center pursuant to Creative Commons Attribution-NonCommercial-ShareAlike (CC BY-NC-SA).",,,English,,,,,,,,,,,,,,,,,,,,,,,,,,,,,,,,,,,,,,,,,,,,,,,,,,,,,,,,,,,,,,,,,,,,,,,,,,,,,,,,"1890's,Joseph Simon,Merchant,Newspapers,Newspapers-Wilmington,North Carolina,Simon,Store,Wilmington, North Carolina",https://lebanesestudies.omeka.chass.ncsu.edu/files/original/cff35496be47ac7a4d201185af682db4.jpg,Newspaper,"North Carolina Newspapers",1,1
81125,https://lebanesestudies.omeka.chass.ncsu.edu/items/show/81125,,,,,,,,,,,,,,,,,,,,,,,,,,,,,,,,,,,,,,,,,"""Joseph Heads Lebanese Dinner"" Newspaper Clipping ","Lebanese Americans","Newspaper clipping announcing that Charles Joseph will serve as general chairman at the Lebanon-American Club's 27th annual dinner.",,"Genevieve Rose Joseph","Moise A. Khayrallah Center for Lebanese Diaspora Studies","circa 1961 Jan",,"The donor retains full ownership of any copyright and rights currently controlled. Nonexclusive right to authorize uses of these materials for non-commercial research, scholarly, or other educational purposes are granted to Khayrallah Center pursuant to U.S. Copyright Law. Usage of the materials for these purposes must be fully credited with the source. The user assumes full responsibility for any use of the materials.",,Text/pdf,English,Text,kc0062_4_3_007,,,,,,,,,,,,,,,,,,,,,,,,,,,,,,,,,,,,,,,,,,,,,,,,,,,,,,,,,,,,,,,,,,,,,,,,,,,,,,"1960s,Events,Food,New York,Newspapers",https://lebanesestudies.omeka.chass.ncsu.edu/files/original/608c2ea15fbcadcfddfd8e3a2a46eeff.pdf,,"Joseph Family Papers",1,1
994,https://lebanesestudies.omeka.chass.ncsu.edu/items/show/994,,,,,,,,,,,,,,,,,,,,,,,,,,,,,,,,,,,,,,,,,"""Joseph Michel, an Assyrian, was officially declared insane..."" 1900",,,"The News Dispatch","Special Collections Department, North Carolina Room, New Hanover County Public Library, Wilmington, North Carolina","""The News Dispatch""^^Moise A. Khayrallah Center for Lebanese Diaspora Studies","May 8, 1900",,"Donor retains full ownership of any and all copyright currently controlled in agreement with Khayrallah Center. Nonexclusive right to authorize all uses of these materials for non-commercial research, scholarly, or other educational purposes are granted to Khayrallah Center pursuant to Creative Commons Attribution-NonCommercial-ShareAlike (CC BY-NC-SA).",,,English,,,,,,,,,,,,,,,,,,,,,,,,,,,,,,,,,,,,,,,,,,,,,,,,,,,,,,,,,,,,,,,,,,,,,,,,,,,,,,,,"1900's,Assyrian,Joseph Michel,Michel,Newspapers,Newspapers-Wilmington,North Carolina,Wilmington, North Carolina",https://lebanesestudies.omeka.chass.ncsu.edu/files/original/caf1f84bf0ddc061c74906b5c45e770d.jpg,Newspaper,"North Carolina Newspapers",1,1
995,https://lebanesestudies.omeka.chass.ncsu.edu/items/show/995,,,,,,,,,,,,,,,,,,,,,,,,,,,,,,,,,,,,,,,,,"""Joseph Michel...died in the City Hospital..."" 1900",,,"The Morning Star","Special Collections Department, North Carolina Room, New Hanover County Public Library, Wilmington, North Carolina","""The Morning Star""^^Moise A. Khayrallah Center for Lebanese Diaspora Studies","May 17, 1900",,"Donor retains full ownership of any and all copyright currently controlled in agreement with Khayrallah Center. Nonexclusive right to authorize all uses of these materials for non-commercial research, scholarly, or other educational purposes are granted to Khayrallah Center pursuant to Creative Commons Attribution-NonCommercial-ShareAlike (CC BY-NC-SA).",,,English,,,,,,,,,,,,,,,,,,,,,,,,,,,,,,,,,,,,,,,,,,,,,,,,,,,,,,,,,,,,,,,,,,,,,,,,,,,,,,,,"1900's,Death,Joseph Michel,Michel,Newspapers,Newspapers-Wilmington,North Carolina,Obituaries,Syrian,Wilmington, North Carolina",https://lebanesestudies.omeka.chass.ncsu.edu/files/original/13ed7cc916ab747ea663c6134ba7b6bf.jpg,Newspaper,"North Carolina Newspapers",1,1
996,https://lebanesestudies.omeka.chass.ncsu.edu/items/show/996,,,,,,,,,,,,,,,,,,,,,,,,,,,,,,,,,,,,,,,,,"""Joseph Mitchell...has been declared insane..."" 1900",,,"The Morning Star","Special Collections Department, North Carolina Room, New Hanover County Public Library, Wilmington, North Carolina","""The Morning Star""^^Moise A. Khayrallah Center for Lebanese Diaspora Studies","May 9, 1900",,"Donor retains full ownership of any and all copyright currently controlled in agreement with Khayrallah Center. Nonexclusive right to authorize all uses of these materials for non-commercial research, scholarly, or other educational purposes are granted to Khayrallah Center pursuant to Creative Commons Attribution-NonCommercial-ShareAlike (CC BY-NC-SA).",,,English,,,,,,,,,,,,,,,,,,,,,,,,,,,,,,,,,,,,,,,,,,,,,,,,,,,,,,,,,,,,,,,,,,,,,,,,,,,,,,,,"1900's,Michel,Newspapers,Newspapers-Wilmington,North Carolina,Syrian,Wilmington, North Carolina",https://lebanesestudies.omeka.chass.ncsu.edu/files/original/8572f8056bd0cc0938342db93ab5f5fd.jpg,Newspaper,"North Carolina Newspapers",1,1
1035,https://lebanesestudies.omeka.chass.ncsu.edu/items/show/1035,,,,,,,,,,,,,,,,,,,,,,,,,,,,,,,,,,,,,,,,,"""Joseph Simon (Syrian) charged with disorderly conduct..."" 1896",,,"The News Dispatch","Special Collections Department, North Carolina Room, New Hanover County Public Library, Wilmington, North Carolina","""The News Dispatch""^^Moise A. Khayrallah Center for Lebanese Diaspora Studies","December 18, 1896",,"Donor retains full ownership of any and all copyright currently controlled in agreement with Khayrallah Center. Nonexclusive right to authorize all uses of these materials for non-commercial research, scholarly, or other educational purposes are granted to Khayrallah Center pursuant to Creative Commons Attribution-NonCommercial-ShareAlike (CC BY-NC-SA).",,,English,,,,,,,,,,,,,,,,,,,,,,,,,,,,,,,,,,,,,,,,,,,,,,,,,,,,,,,,,,,,,,,,,,,,,,,,,,,,,,,,"1890's,Joseph Simon,Law,Newspapers,Newspapers-Wilmington,North Carolina,Simon,Wilmington, North Carolina",https://lebanesestudies.omeka.chass.ncsu.edu/files/original/91070720fb8d5a491e1050a2951e88f1.jpg,Newspaper,"North Carolina Newspapers",1,1
1036,https://lebanesestudies.omeka.chass.ncsu.edu/items/show/1036,,,,,,,,,,,,,,,,,,,,,,,,,,,,,,,,,,,,,,,,,"""Joseph Simon...was arrested this morning..."" 1897",,,"The News Dispatch","Special Collections Department, North Carolina Room, New Hanover County Public Library, Wilmington, North Carolina","""The News Dispatch""^^Moise A. Khayrallah Center for Lebanese Diaspora Studies","November 19, 1897",,"Donor retains full ownership of any and all copyright currently controlled in agreement with Khayrallah Center. Nonexclusive right to authorize all uses of these materials for non-commercial research, scholarly, or other educational purposes are granted to Khayrallah Center pursuant to Creative Commons Attribution-NonCommercial-ShareAlike (CC BY-NC-SA).",,,English,,,,,,,,,,,,,,,,,,,,,,,,,,,,,,,,,,,,,,,,,,,,,,,,,,,,,,,,,,,,,,,,,,,,,,,,,,,,,,,,"1890's,Assyrian,Joseph Simon,Law,Merchant,Newspapers,Newspapers-Wilmington,North Carolina,Simon,Wilmington, North Carolina",https://lebanesestudies.omeka.chass.ncsu.edu/files/original/acd6856c094bc65748658c5b2ee78960.jpg,Newspaper,"North Carolina Newspapers",1,1
78446,https://lebanesestudies.omeka.chass.ncsu.edu/items/show/78446,,,,,,,,,,,,,,,,,,,,,,,,,,,,,,,,,,,,,,,,,"""Joseph Zaytoun: Enjoying Insurance for Three Generations""","Lebanese--United States","An article that includes an interview with Joseph Zaytoun about his life and work. Includes a list of all of his accomplishments and affiliations. ",,"Stephen Zaytoun","Moise A. Khayrallah Center for Lebanese Diaspora Studies","1993 September 01",,"The donor retains full ownership of any copyright and rights currently controlled. Nonexclusive right to authorize uses of these materials for non-commercial research, scholarly, or other educational purposes are granted to Khayrallah Center pursuant to U.S. Copyright Law. Usage of the materials for these purposes must be fully credited with the source. The user assumes full responsibility for any use of the materials.",,Text/pdf,English,Text,kc0030_007,,,,,,,,,,,,,,,,,,,,,,,,,,,,,,,,,,,,,,,,,,,,,,,,,,,,,,,,,,,,,,,,,,,,,,,,,,,,,,"1990s,Biographies,Newspapers",https://lebanesestudies.omeka.chass.ncsu.edu/files/original/993f50c85177bf130f2638f1ee57df02.pdf,,"Joseph and Thelma Knuckley Zaytoun Papers",1,0
80403,https://lebanesestudies.omeka.chass.ncsu.edu/items/show/80403,,,,,,,,,,,,,,,,,,,,,,,,,,,,,,,,,,,,,,,,,"""Josephs Gather"" Newspaper Article","Lebanese Americans","Article titled ""Josephs Gather"" discussing the Easter events held by the Josephs of Wendell, North Carolina.",,"Genevieve Rose Joseph","Moise A. Khayrallah Center for Lebanese Diaspora Studies","1985 Apr",,"The donor retains full ownership of any copyright and rights currently controlled. Nonexclusive right to authorize uses of these materials for non-commercial research, scholarly, or other educational purposes are granted to Khayrallah Center pursuant to U.S. Copyright Law. Usage of the materials for these purposes must be fully credited with the source. The user assumes full responsibility for any use of the materials.",,Text/pdf,English,Text,kc0062_1_11_029,,,,,,,,,,,,,,,,,,,,,,,,,,,,,,,,,,,,,,,,,,,,,,,,,,,,,,,,,,,,,,,,,,,,,,,,,,,,,,"1980s,Easter,Events,Newspapers,Travel",https://lebanesestudies.omeka.chass.ncsu.edu/files/original/02a781495bc5fbcb8b7e2e375b8ad8a4.pdf,,"Joseph Family Papers",1,1
1040,https://lebanesestudies.omeka.chass.ncsu.edu/items/show/1040,,,,,,,,,,,,,,,,,,,,,,,,,,,,,,,,,,,,,,,,,"""Josh Simon, a Syrian, was arraigned before Mayor Waddell...on the charge of steeling..."" 1900",,,"The Morning Star","Special Collections Department, North Carolina Room, New Hanover County Public Library, Wilmington, North Carolina","""The Morning Star""^^Moise A. Khayrallah Center for Lebanese Diaspora Studies","June 2, 1900",,"Donor retains full ownership of any and all copyright currently controlled in agreement with Khayrallah Center. Nonexclusive right to authorize all uses of these materials for non-commercial research, scholarly, or other educational purposes are granted to Khayrallah Center pursuant to Creative Commons Attribution-NonCommercial-ShareAlike (CC BY-NC-SA).",,,English,,,,,,,,,,,,,,,,,,,,,,,,,,,,,,,,,,,,,,,,,,,,,,,,,,,,,,,,,,,,,,,,,,,,,,,,,,,,,,,,"1900's,Josh Simon,Law,Newspapers,Newspapers-Wilmington,North Carolina,Simon,Syrian,Wilmington, North Carolina",https://lebanesestudies.omeka.chass.ncsu.edu/files/original/cb49ef5f944b25a06d2df45278db23bb.jpg,Newspaper,"North Carolina Newspapers",1,1
1044,https://lebanesestudies.omeka.chass.ncsu.edu/items/show/1044,,,,,,,,,,,,,,,,,,,,,,,,,,,,,,,,,,,,,,,,,"""Josh Simon, a well-known merchant of the Syrian colony, has gone for a trip back..."" 1907",,,"The Morning Star","Special Collections Department, North Carolina Room, New Hanover County Public Library, Wilmington, North Carolina","""The Morning Star""^^Moise A. Khayrallah Center for Lebanese Diaspora Studies","May 14, 1907",,"Donor retains full ownership of any and all copyright currently controlled in agreement with Khayrallah Center. Nonexclusive right to authorize all uses of these materials for non-commercial research, scholarly, or other educational purposes are granted to Khayrallah Center pursuant to Creative Commons Attribution-NonCommercial-ShareAlike (CC BY-NC-SA).",,,English,,,,,,,,,,,,,,,,,,,,,,,,,,,,,,,,,,,,,,,,,,,,,,,,,,,,,,,,,,,,,,,,,,,,,,,,,,,,,,,,"1900's,Josh Simon,Merchant,Newspapers,Newspapers-Wilmington,North Carolina,Simon,Syrian,Transmigration,Wilmington, North Carolina",https://lebanesestudies.omeka.chass.ncsu.edu/files/original/7e51b4f8d734004187d0dbdd4e145bcb.jpg,Newspaper,"North Carolina Newspapers",1,1
81934,https://lebanesestudies.omeka.chass.ncsu.edu/items/show/81934,,,,,,,,,,,,,,,,,,,,,,,,,,,,,,,,,,,,,,,,,"""K of C honors Ellis memory""","Newspapers^^Social groups","An article describing a Knights of Columbus meeting to take place in the memory of the late Albert Ellis.",,,"Moise A. Khayrallah Center for Lebanese Diaspora Studies","1970 September 19",,"The donor retains full ownership of any copyright and rights currently controlled. Nonexclusive right to authorize uses of these materials for non-commercial research, scholarly, or other educational purposes are granted to Khayrallah Center pursuant to U.S. Copyright Law. Usage of the materials for these purposes must be fully credited with the source. The user assumes full responsibility for any use of the materials.",,Text/pdf,English,Text,AEllis_013,,,,,,,,,,,,,,,,,,,,,,,,,,,,,,,,,,,,,,,,,,,,,,,,,,,,,,,,,,,,,,,,,,,,,,,,,,,,,,"1970,Events,Newspapers",https://lebanesestudies.omeka.chass.ncsu.edu/files/original/080ec6f46487b4cb230a3582e164d0f5.pdf,,"Albert J. Ellis Papers",1,0