﻿"Item Id","Item URI","Dublin Core:Alternative Title","Dublin Core:Abstract","Dublin Core:Table Of Contents","Dublin Core:Date Available","Dublin Core:Date Created","Dublin Core:Date Accepted","Dublin Core:Date Copyrighted","Dublin Core:Date Submitted","Dublin Core:Date Issued","Dublin Core:Date Modified","Dublin Core:Date Valid","Dublin Core:Access Rights","Dublin Core:License","Dublin Core:Conforms To","Dublin Core:Has Format","Dublin Core:Has Part","Dublin Core:Has Version","Dublin Core:Is Format Of","Dublin Core:Is Part Of","Dublin Core:Is Referenced By","Dublin Core:Is Replaced By","Dublin Core:Is Required By","Dublin Core:Is Version Of","Dublin Core:References","Dublin Core:Replaces","Dublin Core:Requires","Dublin Core:Extent","Dublin Core:Medium","Dublin Core:Bibliographic Citation","Dublin Core:Spatial Coverage","Dublin Core:Temporal Coverage","Dublin Core:Accrual Method","Dublin Core:Accrual Periodicity","Dublin Core:Accrual Policy","Dublin Core:Audience","Dublin Core:Audience Education Level","Dublin Core:Mediator","Dublin Core:Instructional Method","Dublin Core:Provenance","Dublin Core:Rights Holder","Dublin Core:Title","Dublin Core:Subject","Dublin Core:Description","Dublin Core:Creator","Dublin Core:Source","Dublin Core:Publisher","Dublin Core:Date","Dublin Core:Contributor","Dublin Core:Rights","Dublin Core:Relation","Dublin Core:Format","Dublin Core:Language","Dublin Core:Type","Dublin Core:Identifier","Dublin Core:Coverage","Item Type Metadata:Text","Item Type Metadata:Interviewer","Item Type Metadata:Interviewee","Item Type Metadata:Location","Item Type Metadata:Transcription","Item Type Metadata:Local URL","Item Type Metadata:Original Format","Item Type Metadata:Physical Dimensions","Item Type Metadata:Duration","Item Type Metadata:Compression","Item Type Metadata:Producer","Item Type Metadata:Director","Item Type Metadata:Bit Rate/Frequency","Item Type Metadata:Time Summary","Item Type Metadata:Email Body","Item Type Metadata:Subject Line","Item Type Metadata:From","Item Type Metadata:To","Item Type Metadata:CC","Item Type Metadata:BCC","Item Type Metadata:Number of Attachments","Item Type Metadata:Standards","Item Type Metadata:Objectives","Item Type Metadata:Materials","Item Type Metadata:Lesson Plan Text","Item Type Metadata:URL","Item Type Metadata:Event Type","Item Type Metadata:Participants","Item Type Metadata:Birth Date","Item Type Metadata:Birthplace","Item Type Metadata:Death Date","Item Type Metadata:Occupation","Item Type Metadata:Biographical Text","Item Type Metadata:Bibliography","Item Type Metadata:First Name (English)","Item Type Metadata:Last Name (English)","Item Type Metadata:Address","Item Type Metadata:City","Item Type Metadata:State","Item Type Metadata:Business (English)","Item Type Metadata:Provenance (English)","Item Type Metadata:Provenance (Arabic)","Item Type Metadata:Business (Arabic)","Item Type Metadata:Last Name (Arabic)","Item Type Metadata:First Name (Arabic)","Item Type Metadata:Player","Omeka Legacy File:Additional Creator","Omeka Legacy File:Transcriber","Omeka Legacy File:Producer","Omeka Legacy File:Render Device","Omeka Legacy File:Render Details","Omeka Legacy File:Capture Date","Omeka Legacy File:Capture Device","Omeka Legacy File:Capture Details","Omeka Legacy File:Change History","Omeka Legacy File:Watermark","Omeka Legacy File:Encryption","Omeka Legacy File:Compression","Omeka Legacy File:Post Processing","Omeka Image File:Width","Omeka Image File:Height","Omeka Image File:Bit Depth","Omeka Image File:Channels","Omeka Image File:Exif String","Omeka Image File:Exif Array","Omeka Image File:IPTC String","Omeka Image File:IPTC Array","Omeka Video File:Bitrate","Omeka Video File:Duration","Omeka Video File:Sample Rate","Omeka Video File:Codec","Omeka Video File:Width","Omeka Video File:Height","PDF Text:Text","Users Elements:Test","Test Elements:Test",tags,file,itemType,collection,public,featured
979,https://lebanesestudies.omeka.chass.ncsu.edu/items/show/979,,,,,,,,,,,,,,,,,,,,,,,,,,,,,,,,,,,,,,,,,"""A Syrian Merchant's Way."" 1902",,,"The Morning Star","Special Collections Department, North Carolina Room, New Hanover County Public Library, Wilmington, North Carolina","""The Morning Star""^^Moise A. Khayrallah Center for Lebanese Diaspora Studies","April 3, 1902",,"Donor retains full ownership of any and all copyright currently controlled in agreement with Khayrallah Center. Nonexclusive right to authorize all uses of these materials for non-commercial research, scholarly, or other educational purposes are granted to Khayrallah Center pursuant to Creative Commons Attribution-NonCommercial-ShareAlike (CC BY-NC-SA).",,,English,,,,,,,,,,,,,,,,,,,,,,,,,,,,,,,,,,,,,,,,,,,,,,,,,,,,,,,,,,,,,,,,,,,,,,,,,,,,,,,,"1900's,Businesses,Crime,Diabe Kalille,Kalille,Merchant,Newspapers,Newspapers-Wilmington,North Carolina,Race,Store,Syrian,Wilmington, North Carolina",https://lebanesestudies.omeka.chass.ncsu.edu/files/original/91498ac70a112e4ab95e90f53a163ad8.jpg,Newspaper,"North Carolina Newspapers",1,1
1013,https://lebanesestudies.omeka.chass.ncsu.edu/items/show/1013,,,,,,,,,,,,,,,,,,,,,,,,,,,,,,,,,,,,,,,,,"""A Syrian Wedding. Nackley Scraehid...was married...to Miss Mary Gideon..."" 1897",,,"The Wilmington Messenger","Special Collections Department, North Carolina Room, New Hanover County Public Library, Wilmington, North Carolina","Moise A. Khayrallah Center for Lebanese Diaspora Studies^^Moise A. Khayrallah Center for Lebanese Diaspora Studies","February 3, 1897",,"Donor retains full ownership of any and all copyright currently controlled in agreement with Khayrallah Center. Nonexclusive right to authorize all uses of these materials for non-commercial research, scholarly, or other educational purposes are granted to Khayrallah Center pursuant to Creative Commons Attribution-NonCommercial-ShareAlike (CC BY-NC-SA).",,Image/jpg,English,Text,,,,,,,,,,,,,,,,,,,,,,,,,,,,,,,,,,,,,,,,,,,,,,,,,,,,,,,,,,,,,,,,,,,,,,,,,,,,,,,"1890's,Charleston, South Carolina,Gideon,Marriages,Mary Gideon,Nackley Scraehid,Newspapers,Newspapers-Wilmington,Nockley Schrohid,North Carolina,Schrohid,Scraehid,South Carolina,St. Thomas Catholic Church Wilmington,Wilmington, North Carolina",https://lebanesestudies.omeka.chass.ncsu.edu/files/original/d6403ae1185ece527e48f43b886dcdd1.jpg,Newspaper,"North Carolina Newspapers",1,1
925,https://lebanesestudies.omeka.chass.ncsu.edu/items/show/925,,,,,,,,,,,,,,,,,,,,,,,,,,,,,,,,,,,,,,,,,"""A Syrian, H. Abdella, was tried by Justice Fowler yesterday for larceny by trick."" 1899",,,"The Wilmington Messenger","Special Collections Department, North Carolina Room, New Hanover County Public Library, Wilmington, North Carolina","The Wilmington Messenger^^Moise A. Khayrallah Center for Lebanese Diaspora Studies","June 29, 1899",,"Donor retains full ownership of any and all copyright currently controlled in agreement with Khayrallah Center. Nonexclusive right to authorize all uses of these materials for non-commercial research, scholarly, or other educational purposes are granted to Khayrallah Center pursuant to Creative Commons Attribution-NonCommercial-ShareAlike (CC BY-NC-SA).",,,English,,,,,,,,,,,,,,,,,,,,,,,,,,,,,,,,,,,,,,,,,,,,,,,,,,,,,,,,,,,,,,,,,,,,,,,,,,,,,,,,"1890's,Crime,Newspapers,Newspapers-Wilmington,North Carolina,Wilmington, North Carolina",https://lebanesestudies.omeka.chass.ncsu.edu/files/original/23b14df8946b6519a88340ee9c092175.jpg,Newspaper,"North Carolina Newspapers",1,1
947,https://lebanesestudies.omeka.chass.ncsu.edu/items/show/947,,,,,,,,,,,,,,,,,,,,,,,,,,,,,,,,,,,,,,,,,"""A Syrian, Henry Dielepop, was tried in the police court..."" 1899",,,"The Wilmington Messenger","Special Collections Department, North Carolina Room, New Hanover County Public Library, Wilmington, North Carolina","The Wilmington Messenger^^Moise A. Khayrallah Center for Lebanese Diaspora Studies","June 15, 1899",,"Donor retains full ownership of any and all copyright currently controlled in agreement with Khayrallah Center. Nonexclusive right to authorize all uses of these materials for non-commercial research, scholarly, or other educational purposes are granted to Khayrallah Center pursuant to Creative Commons Attribution-NonCommercial-ShareAlike (CC BY-NC-SA).",,,English,,,,,,,,,,,,,,,,,,,,,,,,,,,,,,,,,,,,,,,,,,,,,,,,,,,,,,,,,,,,,,,,,,,,,,,,,,,,,,,,"1890's,Crime,Newspapers,Newspapers-Wilmington,North Carolina,Syrian,Wilmington, North Carolina",https://lebanesestudies.omeka.chass.ncsu.edu/files/original/44dba15ab56006fc3211073543d8b083.jpg,Newspaper,"North Carolina Newspapers",1,1
1019,https://lebanesestudies.omeka.chass.ncsu.edu/items/show/1019,,,,,,,,,,,,,,,,,,,,,,,,,,,,,,,,,,,,,,,,,"""About A Pair Of Pants. A Trial in which an Assyrian and an African Figured."" 1899",,,"The News Dispatch","Special Collections Department, North Carolina Room, New Hanover County Public Library, Wilmington, North Carolina","""The News Dispatch""^^Moise A. Khayrallah Center for Lebanese Diaspora Studies","July 18, 1899",,"Donor retains full ownership of any and all copyright currently controlled in agreement with Khayrallah Center. Nonexclusive right to authorize all uses of these materials for non-commercial research, scholarly, or other educational purposes are granted to Khayrallah Center pursuant to Creative Commons Attribution-NonCommercial-ShareAlike (CC BY-NC-SA).",,,English,,,,,,,,,,,,,,,,,,,,,,,,,,,,,,,,,,,,,,,,,,,,,,,,,,,,,,,,,,,,,,,,,,,,,,,,,,,,,,,,"1890's,Law,Newspapers,Newspapers-Wilmington,North Carolina,Race,Shibley,Wilmington, North Carolina",https://lebanesestudies.omeka.chass.ncsu.edu/files/original/6dc46b7979b13bcb678ccaf53ab47cad.jpg,Newspaper,"North Carolina Newspapers",1,1
80446,https://lebanesestudies.omeka.chass.ncsu.edu/items/show/80446,,,,,,,,,,,,,,,,,,,,,,,,,,,,,,,,,,,,,,,,,"""Al Nadeem Bybliorama""","Lebanese Americans","Magazine containing news and paid sponsorships.",,"Genevieve Rose Joseph","Moise A. Khayrallah Center for Lebanese Diaspora Studies",2002,,"The donor retains full ownership of any copyright and rights currently controlled. Nonexclusive right to authorize uses of these materials for non-commercial research, scholarly, or other educational purposes are granted to Khayrallah Center pursuant to U.S. Copyright Law. Usage of the materials for these purposes must be fully credited with the source. The user assumes full responsibility for any use of the materials.",,Text/pdf,Arabic,Text,kc0062_1_3_003,,,,,,,,,,,,,,,,,,,,,,,,,,,,,,,,,,,,,,,,,,,,,,,,,,,,,,,,,,,,,,,,,,,,,,,,,,,,,,Magazines,https://lebanesestudies.omeka.chass.ncsu.edu/files/original/cd2a770b565d679d52a6d08d95541e5e.pdf,,"Joseph Family Papers",1,1
12660,https://lebanesestudies.omeka.chass.ncsu.edu/items/show/12660,,,,,,,,,,,,,,,,,,,,,,,,,,,,,,,,,,,,,,,,,"""Al-Hoda, Multidimensional Role""","Commemorations--United States^^Civic Leaders--New York","A piece by Ameen Rihani for the Al-Hoda Centennial. (Folder 1-3-2-2)","Ameen Albert Rihani","Helen Samhan","Moise A. Khayrallah Center for Lebanese Diaspora Studies","December 3, 1998",,"Donor retains full ownership of any and all copyright currently controlled in agreement with Khayrallah Center. Nonexclusive right to authorize all uses of these materials for non-commercial research, scholarly, or other educational purposes are granted to Khayrallah Center pursuant to Creative Commons Attribution-NonCommercial-ShareAlike (CC BY-NC-SA).",,Text/pdf,English,Text,,,,,,,,,Paper,,,,,,,,,,,,,,,,,,,,,,,,,,,,,,,,,,,,,,,,,,,,,,,,,,,,,,,,,,,,,,,,,,,,,,"1990's,Al-Hoda,Al-Hoda Centennial,Ameen Rihani,Rihani",https://lebanesestudies.omeka.chass.ncsu.edu/files/original/6fb77a1db8e785aaabd962328765ebba.pdf,Document,"Mokarzel Family",1,0
80473,https://lebanesestudies.omeka.chass.ncsu.edu/items/show/80473,,,,,,,,,,,,,,,,,,,,,,,,,,,,,,,,,,,,,,,,,"""Albany 1st Night"" Newspaper Article","Lebanese Americans^^ Belly dance","Newspaper article about the Albany First Night festival, in which the Yallah Dance Ensemble performed.","Erwin Karl","Genevieve Rose Joseph","Moise A. Khayrallah Center for Lebanese Diaspora Studies","1993 Dec",,"The donor retains full ownership of any copyright and rights currently controlled. Nonexclusive right to authorize uses of these materials for non-commercial research, scholarly, or other educational purposes are granted to Khayrallah Center pursuant to U.S. Copyright Law. Usage of the materials for these purposes must be fully credited with the source. The user assumes full responsibility for any use of the materials.",,Text/pdf,English,Text,kc0062_1_8_017,,,,,,,,,,,,,,,,,,,,,,,,,,,,,,,,,,,,,,,,,,,,,,,,,,,,,,,,,,,,,,,,,,,,,,,,,,,,,,"1990s,Dance,Events,New York,Newspapers",https://lebanesestudies.omeka.chass.ncsu.edu/files/original/77d48b9343986217a4e7c8c08de80d29.pdf,,"Joseph Family Papers",1,1
80472,https://lebanesestudies.omeka.chass.ncsu.edu/items/show/80472,,,,,,,,,,,,,,,,,,,,,,,,,,,,,,,,,,,,,,,,,"""Albany prepares for festive First Night"" Newspaper Article","Lebanese Americans^^ Belly dance","Newspaper article about the Albany First Night festival, in which the Yallah Dance Ensemble performed.",,"Genevieve Rose Joseph","Moise A. Khayrallah Center for Lebanese Diaspora Studies","1993 Dec 29",,"The donor retains full ownership of any copyright and rights currently controlled. Nonexclusive right to authorize uses of these materials for non-commercial research, scholarly, or other educational purposes are granted to Khayrallah Center pursuant to U.S. Copyright Law. Usage of the materials for these purposes must be fully credited with the source. The user assumes full responsibility for any use of the materials.",,Text/pdf,English,Text,kc0062_1_8_016,,,,,,,,,,,,,,,,,,,,,,,,,,,,,,,,,,,,,,,,,,,,,,,,,,,,,,,,,,,,,,,,,,,,,,,,,,,,,,"1990s,Dance,Events,New York,Newspapers",https://lebanesestudies.omeka.chass.ncsu.edu/files/original/16a0c95a9a8e31e70392a3f2a16a8a33.pdf,,"Joseph Family Papers",1,1
81947,https://lebanesestudies.omeka.chass.ncsu.edu/items/show/81947,,,,,,,,,,,,,,,,,,,,,,,,,,,,,,,,,,,,,,,,,"""Albert Ellis""",Newspapers^^Obituaries,"An article from the Jacksonville Daily News describing the contributions that Albert Ellis made to his community before his death.","Jacksonville Daily News",,"Moise A. Khayrallah Center for Lebanese Diaspora Studies","1969 December 15",,"The donor retains full ownership of any copyright and rights currently controlled. Nonexclusive right to authorize uses of these materials for non-commercial research, scholarly, or other educational purposes are granted to Khayrallah Center pursuant to U.S. Copyright Law. Usage of the materials for these purposes must be fully credited with the source. The user assumes full responsibility for any use of the materials.",,Text/pdf,English,Text,AEllis_017,,,,,,,,,,,,,,,,,,,,,,,,,,,,,,,,,,,,,,,,,,,,,,,,,,,,,,,,,,,,,,,,,,,,,,,,,,,,,,"1960s,Obituaries",https://lebanesestudies.omeka.chass.ncsu.edu/files/original/57b69a8206a9712cfb5ee3e776e0bb1c.pdf,,"Albert J. Ellis Papers",1,0
80484,https://lebanesestudies.omeka.chass.ncsu.edu/items/show/80484,,,,,,,,,,,,,,,,,,,,,,,,,,,,,,,,,,,,,,,,,"""Ali Baba Night"" Flyer","Lebanese Americans^^ Belly dance","Flyer for an event titled ""Ali Baba Night: An Evening of Middle East Entertainment,"" including a performance by the Yallah Dance Ensemble.",Meridya,"Genevieve Rose Joseph","Moise A. Khayrallah Center for Lebanese Diaspora Studies","1991 May 18",,"The donor retains full ownership of any copyright and rights currently controlled. Nonexclusive right to authorize uses of these materials for non-commercial research, scholarly, or other educational purposes are granted to Khayrallah Center pursuant to U.S. Copyright Law. Usage of the materials for these purposes must be fully credited with the source. The user assumes full responsibility for any use of the materials.",,Text/pdf,English,Text,kc0062_1_8_028,,,,,,,,,,,,,,,,,,,,,,,,,,,,,,,,,,,,,,,,,,,,,,,,,,,,,,,,,,,,,,,,,,,,,,,,,,,,,,"1990s,Dance,Events,New York",https://lebanesestudies.omeka.chass.ncsu.edu/files/original/1a048cec9e43c84a1caca2277d367ce5.pdf,,"Joseph Family Papers",1,1
81547,https://lebanesestudies.omeka.chass.ncsu.edu/items/show/81547,,,,,,,,,,,,,,,,,,,,,,,,,,,,,,,,,,,,,,,,,"""American Pupils Abroad Heard Just French^^ Teacher Praises That Method at Conference""","Lebanese--United States","Article from February 5, 1966, in The Atlanta Constitution titled ""American Pupils Abroad Heard Just French^^ Teacher Praises That Method at Conference."" Nell Kahdy discusses the immersion method for language learning. ","The Atlanta Constitution","Barbara Kahdy Estes","Moise A. Khayrallah Center for Lebanese Diaspora Studies",1966,,"The donor retains full ownership of any copyright and rights currently controlled. Nonexclusive right to authorize uses of these materials for non-commercial research, scholarly, or other educational purposes are granted to Khayrallah Center pursuant to U.S. Copyright Law. Usage of the materials for these purposes must be fully credited with the source. The user assumes full responsibility for any use of the materials.",,Text/pdf,English,Text,Kahdy2015_058,,,,,,,,,,,,,,,,,,,,,,,,,,,,,,,,,,,,,,,,,,,,,,,,,,,,,,,,,,,,,,,,,,,,,,,,,,,,,,"1960s,Education,Newspapers",https://lebanesestudies.omeka.chass.ncsu.edu/files/original/dacc0e2f363e63f07651f13b0d346539.pdf,,"Kahdy and Wehbie Family Papers",1,0
981,https://lebanesestudies.omeka.chass.ncsu.edu/items/show/981,,,,,,,,,,,,,,,,,,,,,,,,,,,,,,,,,,,,,,,,,"""An Asyrian Mix-Up. A Live Fight on Market Street Yesterday in Which Five Asyrians Participated."" 1905",,,"The Wilmington Messenger","Special Collections Department, North Carolina Room, New Hanover County Public Library, Wilmington, North Carolina","The Wilmington Messenger^^Moise A. Khayrallah Center for Lebanese Diaspora Studies","October 10, 1905",,"Donor retains full ownership of any and all copyright currently controlled in agreement with Khayrallah Center. Nonexclusive right to authorize all uses of these materials for non-commercial research, scholarly, or other educational purposes are granted to Khayrallah Center pursuant to Creative Commons Attribution-NonCommercial-ShareAlike (CC BY-NC-SA).",,,English,,,,,,,,,,,,,,,,,,,,,,,,,,,,,,,,,,,,,,,,,,,,,,,,,,,,,,,,,,,,,,,,,,,,,,,,,,,,,,,,"1900's,Arabic,Assyrian,Crime,Diabe Kalille,Kalille,Language,Newspapers,Newspapers-Wilmington,North Carolina,Simon,Wilmington, North Carolina",https://lebanesestudies.omeka.chass.ncsu.edu/files/original/f8bb20e485aedaad1308249e860fea70.jpg,Newspaper,"North Carolina Newspapers",1,1
1002,https://lebanesestudies.omeka.chass.ncsu.edu/items/show/1002,,,,,,,,,,,,,,,,,,,,,,,,,,,,,,,,,,,,,,,,,"""An Incorrigible Syrian. Son of Orient Before Mayor in Police Court--Reckless Driving."" 1907",,,"The Morning Star","Special Collections Department, North Carolina Room, New Hanover County Public Library, Wilmington, North Carolina","""The Morning Star""^^Moise A. Khayrallah Center for Lebanese Diaspora Studies","August 23, 1907",,"Donor retains full ownership of any and all copyright currently controlled in agreement with Khayrallah Center. Nonexclusive right to authorize all uses of these materials for non-commercial research, scholarly, or other educational purposes are granted to Khayrallah Center pursuant to Creative Commons Attribution-NonCommercial-ShareAlike (CC BY-NC-SA).",,,English,,,,,,,,,,,,,,,,,,,,,,,,,,,,,,,,,,,,,,,,,,,,,,,,,,,,,,,,,,,,,,,,,,,,,,,,,,,,,,,,"1900's,Law,Newspapers,Newspapers-Wilmington,North Carolina,Rabil,Syrian,Wilmington, North Carolina",https://lebanesestudies.omeka.chass.ncsu.edu/files/original/ff61bf97bcc1626c75bebb523ae95fd9.jpg,Newspaper,"North Carolina Newspapers",1,1
998,https://lebanesestudies.omeka.chass.ncsu.edu/items/show/998,,,,,,,,,,,,,,,,,,,,,,,,,,,,,,,,,,,,,,,,,"""An Interesting Entertainment. Rev. Faddhul Moghabghab...will deliver a lecture..."" 1894",,,"The Wilmington Messenger","Special Collections Department, North Carolina Room, New Hanover County Public Library, Wilmington, North Carolina","The Wilmington Messenger^^Moise A. Khayrallah Center for Lebanese Diaspora Studies","December 14, 1894",,"Donor retains full ownership of any and all copyright currently controlled in agreement with Khayrallah Center. Nonexclusive right to authorize all uses of these materials for non-commercial research, scholarly, or other educational purposes are granted to Khayrallah Center pursuant to Creative Commons Attribution-NonCommercial-ShareAlike (CC BY-NC-SA).",,,English,,,,,,,,,,,,,,,,,,,,,,,,,,,,,,,,,,,,,,,,,,,,,,,,,,,,,,,,,,,,,,,,,,,,,,,,,,,,,,,,"1890's,American College Beirut,Beirut, Lebanon,Faddhul Moghabghab,Moghabghab,Mount Lebanon,Newspapers,Newspapers-Wilmington,North Carolina,Religion,Syrian,Wilmington, North Carolina",https://lebanesestudies.omeka.chass.ncsu.edu/files/original/65539c215f85b10f6bb27480d1e54f00.jpg,Newspaper,"North Carolina Newspapers",1,1
81979,https://lebanesestudies.omeka.chass.ncsu.edu/items/show/81979,,,,,,,,,,,,,,,,,,,,,,,,,,,,,,,,,,,,,,,,,"""An Old Instrument Made for Cybertimes""",Newspapers^^Music,"Newspaper article titled ""An Old Instrument Made for Cybertimes,"" about the Theremin, written by Barbara Jepson, published in the New York Times 7 July 1996.","New York Times","Oussani Fuleihan family","Moise A. Khayrallah Center for Lebanese Diaspora Studies","1996 July 07",,"The donor retains full ownership of any copyright and rights currently controlled. Nonexclusive right to authorize uses of these materials for non-commercial research, scholarly, or other educational purposes are granted to Khayrallah Center pursuant to U.S. Copyright Law. Usage of the materials for these purposes must be fully credited with the source. The user assumes full responsibility for any use of the materials.",,Text/pdf,English,Text,Oussani2018-1155,,,,,,,,,,,,,,,,,,,,,,,,,,,,,,,,,,,,,,,,,,,,,,,,,,,,,,,,,,,,,,,,,,,,,,,,,,,,,,"1990s,Music,New York",https://lebanesestudies.omeka.chass.ncsu.edu/files/original/87fb2a488bb1362a6cf9d720d98b10c3.pdf,,"Oussani and Fuleihan Family Papers Series 1: Documents",1,0
80372,https://lebanesestudies.omeka.chass.ncsu.edu/items/show/80372,,,,,,,,,,,,,,,,,,,,,,,,,,,,,,,,,,,,,,,,,"""Ancient Egyptian Dances"" Article","Lebanese Americans^^ Belly dance","Article titled ""Ancient Egyptian Dances"" discussing the history of Egyptian dance.",,"Genevieve Rose Joseph","Moise A. Khayrallah Center for Lebanese Diaspora Studies",undated,,"The donor retains full ownership of any copyright and rights currently controlled. Nonexclusive right to authorize uses of these materials for non-commercial research, scholarly, or other educational purposes are granted to Khayrallah Center pursuant to U.S. Copyright Law. Usage of the materials for these purposes must be fully credited with the source. The user assumes full responsibility for any use of the materials.",,Text/pdf,English,Text,kc0062_1_10_005,,,,,,,,,,,,,,,,,,,,,,,,,,,,,,,,,,,,,,,,,,,,,,,,,,,,,,,,,,,,,,,,,,,,,,,,,,,,,,"Articles,Dance",https://lebanesestudies.omeka.chass.ncsu.edu/files/original/9ec6c10c75135a982c661c2362aec05f.pdf,,"Joseph Family Papers",1,1