﻿"Item Id","Item URI","Dublin Core:Alternative Title","Dublin Core:Abstract","Dublin Core:Table Of Contents","Dublin Core:Date Available","Dublin Core:Date Created","Dublin Core:Date Accepted","Dublin Core:Date Copyrighted","Dublin Core:Date Submitted","Dublin Core:Date Issued","Dublin Core:Date Modified","Dublin Core:Date Valid","Dublin Core:Access Rights","Dublin Core:License","Dublin Core:Conforms To","Dublin Core:Has Format","Dublin Core:Has Part","Dublin Core:Has Version","Dublin Core:Is Format Of","Dublin Core:Is Part Of","Dublin Core:Is Referenced By","Dublin Core:Is Replaced By","Dublin Core:Is Required By","Dublin Core:Is Version Of","Dublin Core:References","Dublin Core:Replaces","Dublin Core:Requires","Dublin Core:Extent","Dublin Core:Medium","Dublin Core:Bibliographic Citation","Dublin Core:Spatial Coverage","Dublin Core:Temporal Coverage","Dublin Core:Accrual Method","Dublin Core:Accrual Periodicity","Dublin Core:Accrual Policy","Dublin Core:Audience","Dublin Core:Audience Education Level","Dublin Core:Mediator","Dublin Core:Instructional Method","Dublin Core:Provenance","Dublin Core:Rights Holder","Dublin Core:Title","Dublin Core:Subject","Dublin Core:Description","Dublin Core:Creator","Dublin Core:Source","Dublin Core:Publisher","Dublin Core:Date","Dublin Core:Contributor","Dublin Core:Rights","Dublin Core:Relation","Dublin Core:Format","Dublin Core:Language","Dublin Core:Type","Dublin Core:Identifier","Dublin Core:Coverage","Item Type Metadata:Text","Item Type Metadata:Interviewer","Item Type Metadata:Interviewee","Item Type Metadata:Location","Item Type Metadata:Transcription","Item Type Metadata:Local URL","Item Type Metadata:Original Format","Item Type Metadata:Physical Dimensions","Item Type Metadata:Duration","Item Type Metadata:Compression","Item Type Metadata:Producer","Item Type Metadata:Director","Item Type Metadata:Bit Rate/Frequency","Item Type Metadata:Time Summary","Item Type Metadata:Email Body","Item Type Metadata:Subject Line","Item Type Metadata:From","Item Type Metadata:To","Item Type Metadata:CC","Item Type Metadata:BCC","Item Type Metadata:Number of Attachments","Item Type Metadata:Standards","Item Type Metadata:Objectives","Item Type Metadata:Materials","Item Type Metadata:Lesson Plan Text","Item Type Metadata:URL","Item Type Metadata:Event Type","Item Type Metadata:Participants","Item Type Metadata:Birth Date","Item Type Metadata:Birthplace","Item Type Metadata:Death Date","Item Type Metadata:Occupation","Item Type Metadata:Biographical Text","Item Type Metadata:Bibliography","Item Type Metadata:First Name (English)","Item Type Metadata:Last Name (English)","Item Type Metadata:Address","Item Type Metadata:City","Item Type Metadata:State","Item Type Metadata:Business (English)","Item Type Metadata:Provenance (English)","Item Type Metadata:Provenance (Arabic)","Item Type Metadata:Business (Arabic)","Item Type Metadata:Last Name (Arabic)","Item Type Metadata:First Name (Arabic)","Item Type Metadata:Player","Omeka Legacy File:Additional Creator","Omeka Legacy File:Transcriber","Omeka Legacy File:Producer","Omeka Legacy File:Render Device","Omeka Legacy File:Render Details","Omeka Legacy File:Capture Date","Omeka Legacy File:Capture Device","Omeka Legacy File:Capture Details","Omeka Legacy File:Change History","Omeka Legacy File:Watermark","Omeka Legacy File:Encryption","Omeka Legacy File:Compression","Omeka Legacy File:Post Processing","Omeka Image File:Width","Omeka Image File:Height","Omeka Image File:Bit Depth","Omeka Image File:Channels","Omeka Image File:Exif String","Omeka Image File:Exif Array","Omeka Image File:IPTC String","Omeka Image File:IPTC Array","Omeka Video File:Bitrate","Omeka Video File:Duration","Omeka Video File:Sample Rate","Omeka Video File:Codec","Omeka Video File:Width","Omeka Video File:Height","PDF Text:Text","Users Elements:Test","Test Elements:Test",tags,file,itemType,collection,public,featured
11474,https://lebanesestudies.omeka.chass.ncsu.edu/items/show/11474,,,,,,,,,,,,,,,,,,,,,,,,,,,,,,,,,,,,,,,,,"Joseph El-Khouri Receiving the Mother Teresa Memorial Award (2)","Awards^^Catholicism^^Community service--North Carolina","A photograph of Joseph El-Khouri (center) and Rose El-Khouri (right) on the occasion of Joseph receiving the Mother Teresa Memorial Award.",Unknown,"Marsha El-Khouri Shiver",,2003,,"Donor retains full ownership of any and all copyright currently controlled in agreement with Khayrallah Center. Nonexclusive right to authorize all uses of these materials for non-commercial research, scholarly, or other educational purposes are granted to Khayrallah Center pursuant to Creative Commons Attribution-NonCommercial-ShareAlike (CC BY-NC-SA).","<a href=""http://lebanesestudies.omeka.chass.ncsu.edu/items/show/11472"" target=""_blank"" rel=""noreferrer noopener"">Nomination for Mother Teresa Memorial Award</a>^^<a href=""http://lebanesestudies.omeka.chass.ncsu.edu/items/show/11473"" target=""_blank"" rel=""noreferrer noopener"">Joseph El-Khouri Receiving the Award</a>^^<a href=""http://lebanesestudies.omeka.chass.ncsu.edu/items/show/11479"" target=""_blank"" rel=""noreferrer noopener"">Article About Award</a>",Image/jpg,,Image,"2015 04-19",,,,,,,,"Color photograph",,,,,,,,,,,,,,,,,,,,,,,,,,,,,,,,,,,,,,,,,,,,,,,,,,,,,,,,,,,,,,,,,,,,,,"2000's,Awards,Catholicism,Community Service,El-Khouri,Joseph Maroun El-Khouri,Mother Teresa Memorial Award,Religion,Rose Isaac El-Khouri",https://lebanesestudies.omeka.chass.ncsu.edu/files/original/d501692b1d738f9fdc29531f217137ec.jpg,"Still Image","El-Khouri Family",1,0
1216,https://lebanesestudies.omeka.chass.ncsu.edu/items/show/1216,,,,,,,,,,,,,,,,,,,,,,,,,,,,,,,,,,,,,,,,,"Letter to Joseph Maroun El-Khouri from S. Joseph Beniamin El-Koury, 1960",Correspondence,"Letter to Joseph Maroun El-Khouri of Andrews, North Carolina from S. Joseph Beniamin El-Koury of the Seminary of Karm-Sadde, Lebanon. Postmarked April 4, 1960.","S. Joseph Beniamin El-Koury","Marsha El-Khouri Shiver","Moise A. Khayrallah Center for Lebanese Diaspora Studies","April 4, 1960",,"Donor retains full ownership of any and all copyright currently controlled in agreement with Khayrallah Center. Nonexclusive right to authorize all uses of these materials for non-commercial research, scholarly, or other educational purposes are granted to Khayrallah Center pursuant to Creative Commons Attribution-NonCommercial-ShareAlike (CC BY-NC-SA).",,Image/jpg,"Arabic, English",Text,"2015 05-05",,,,,,,,Paper,,,,,,,,,,,,,,,,,,,,,,,,,,,,,,,,,,,,,,,,,,,,,,,,,,,,,,,,,,,,,,,,,,,,,,"1960's,Andrews, North Carolina,Correspondence,El-Khouri,El-Koury,Joseph Beniamin El-Koury,Joseph Maroun El-Khouri,North Carolina,Nuns,Religion","https://lebanesestudies.omeka.chass.ncsu.edu/files/original/bca54e234ff5257e940c89fda06de98b.jpg,https://lebanesestudies.omeka.chass.ncsu.edu/files/original/cb784d13db120ec141845dffcf9c2edc.jpg,https://lebanesestudies.omeka.chass.ncsu.edu/files/original/21bc2fe3be543c18b4b2df49c9efa085.jpg,https://lebanesestudies.omeka.chass.ncsu.edu/files/original/fe928029b9395a7852fbe9b0a485b0cd.jpg",Document,"El-Khouri Family",1,1
910,https://lebanesestudies.omeka.chass.ncsu.edu/items/show/910,,,,,,,,,,,,,,,,,,,,,,,,,,,,,,,,,,,,,,,,,"""In A Strange Land. Two Assyrian Ministers Pay Wilmington A Visit."" 1898",,,"The News Dispatch","Special Collections Department, North Carolina Room, New Hanover County Public Library, Wilmington, North Carolina","""The News Dispatch""^^Moise A. Khayrallah Center for Lebanese Diaspora Studies","August 8, 1898",,"Donor retains full ownership of any and all copyright currently controlled in agreement with Khayrallah Center. Nonexclusive right to authorize all uses of these materials for non-commercial research, scholarly, or other educational purposes are granted to Khayrallah Center pursuant to Creative Commons Attribution-NonCommercial-ShareAlike (CC BY-NC-SA).",,,English,,,,,,,,,,,,,,,,,,,,,,,,,,,,,,,,,,,,,,,,,,,,,,,,,,,,,,,,,,,,,,,,,,,,,,,,,,,,,,,,"1890's,Armenia,Assyrian,Newspapers,Newspapers-Wilmington,North Carolina,Religion,Wilmington, North Carolina",https://lebanesestudies.omeka.chass.ncsu.edu/files/original/f1282c8ba9d2f788054369ffe266862f.jpg,Newspaper,"North Carolina Newspapers",1,1
136,https://lebanesestudies.omeka.chass.ncsu.edu/items/show/136,,,,,,,,,,,,,,,,,,,,,,,,,,,,,,,,,,,,,,,,,"El-Khouri Family in Lebanon","Group portraits^^Joseph Maroun El--Khouri--Family^^Families--Lebanese--Lebanon^^Nuns--Lebanese--Lebanon^^Priests--Maronite--Lebanese--Lebanon","Caption: ""Joseph El-Khouri (second from left) with Father (Rev. Maroun El-Khouri) & Brothers & Sisters in front of their home in Kour, Batroun Lebanon (1945?)"".  Sister Victorine El-Khouri stands on the far right, but  Joe and Sr. Victorine's other five siblings are not identifiable by name.",Unknown,"Marsha El-Khouri Shiver","Moise A. Khayrallah Center for Lebanese Diaspora Studies","c. 1945",,"Donor retains full ownership of any and all copyright currently controlled in agreement with Khayrallah Center. Nonexclusive right to authorize all uses of these materials for non-commercial research, scholarly, or other educational purposes are granted to Khayrallah Center pursuant to Creative Commons Attribution-NonCommercial-ShareAlike (CC BY-NC-SA).","<a href=""http://lebanesestudies.omeka.chass.ncsu.edu/items/show/1193"">Portrait of Rev. Joseph Michael Maroun El-Khouri</a>",Image/jpg,English,Image,"2015 01-31",,,,,,,,"Black & white photograph",,,,,,,,,,,,,,,,,,,,,,,,,,,,,,,,,,,,,,,,,,,,,,,,,,,,,,,,,,,,,,,,,,,,,,"1940's,El-Khouri,Families,Family Home,Joseph Maroun El-Khouri,Joseph Michael Maroun El-Khouri,Kour, Batroun, Lebanon,Lebanon,Maronite,Nuns,Priests,Religion,Siblings,Sister Victorine El-Khouri","https://lebanesestudies.omeka.chass.ncsu.edu/files/original/ea4d1df295241199b16f17559eeaf8b2.jpg,https://lebanesestudies.omeka.chass.ncsu.edu/files/original/46f88f7d4f694a0d47fdcb5c0acb8385.jpg","Still Image","El-Khouri Family",1,0
11274,https://lebanesestudies.omeka.chass.ncsu.edu/items/show/11274,,,,,,,,,,,,,,,,,,,,,,,,,,,,,,,,,,,,,,,,,"Sister Victorine El-Khouri and  Cousin","Nuns^^Portrait photograph^^Families--Lebanese--Lebanon^^Catholicism--Lebanon","Sister Victorine El-Khouri and cousin in Lebanon.",Unknown,"Marsha El-Khouri Shiver","Moise A. Khayrallah Center for Lebanese Diaspora Studies","circa 1945",,"Donor retains full ownership of any and all copyright currently controlled in agreement with Khayrallah Center. Nonexclusive right to authorize all uses of these materials for non-commercial research, scholarly, or other educational purposes are granted to Khayrallah Center pursuant to Creative Commons Attribution-NonCommercial-ShareAlike (CC BY-NC-SA).",,Image/jpg,,Image,"2015 01-23",,,,,,,,"Black & white photograph",,,,,,,,,,,,,,,,,,,,,,,,,,,,,,,,,,,,,,,,,,,,,,,,,,,,,,,,,,,,,,,,,,,,,,"1940's,Cousins,El-Khouri,Lebanon,Nuns,Religion,Sister Victorine El-Khouri",https://lebanesestudies.omeka.chass.ncsu.edu/files/original/b8fabc2749150664a1373ca88c2bae77.jpg,"Still Image","El-Khouri Family",1,0
11450,https://lebanesestudies.omeka.chass.ncsu.edu/items/show/11450,,,,,,,,,,,,,,,,,,,,,,,,,,,,,,,,,,,,,,,,,"Home Movie of Lebanon [2/6]","Nuns^^Motion pictures--Amateur^^Vacations--Lebanon","This regular 8 reel was generously donated by Marsha Shiver who received the movie from her, Joseph El-Khouri. The video was taken in Lebanon in the mid-1950s. This video includes scenes of the extended El-Khouri family members, including a group of nuns that most likely includes Joseph's sibling Sister Victorine El-Khouri. The video also includes shots of the group dining together as well as a pageant or religious service. The recording does not include sound.",Unknown,"Marsha El-Khouri Shiver","Moise A. Khayrallah Center for Lebanese Diaspora Studies","circa 1950s",,"Donor retains full ownership of any and all copyright currently controlled in agreement with Khayrallah Center. Nonexclusive right to authorize all uses of these materials for non-commercial research, scholarly, or other educational purposes are granted to Khayrallah Center pursuant to Creative Commons Attribution-NonCommercial-ShareAlike (CC BY-NC-SA).",,,,Image,"2015 01-40",,,,,,,,,,"3 minutes 43 seconds",,,,,,,,,,,,,,,,,,,,,,,,,,,,,,,,,,,,,,,,,,,,,,,,,,,,,,,,,,,,,,,,,,,,"1950's,Children,El-Khouri,Home Movies,Lebanon,Motion Pictures,Nuns,Religion,Vacations",https://lebanesestudies.omeka.chass.ncsu.edu/files/original/d43fd9e08be044c4384842e241268d3d.jpg,"Moving Image","El-Khouri Family",1,0
11484,https://lebanesestudies.omeka.chass.ncsu.edu/items/show/11484,,,,,,,,,,,,,,,,,,,,,,,,,,,,,,,,,,,,,,,,,"Article on El-Khouri Family History",Clippings,"An article about Joseph and Rose El-Khouri and their seven children. The periodical in which this article was published is unknown.","Rose El-Khouri","Marsha El-Khouri Shiver",,"circa 1986",Unknown,"Donor retains full ownership of any and all copyright currently controlled in agreement with Khayrallah Center. Nonexclusive right to authorize all uses of these materials for non-commercial research, scholarly, or other educational purposes are granted to Khayrallah Center pursuant to Creative Commons Attribution-NonCommercial-ShareAlike (CC BY-NC-SA).",,Text/pdf,English,Text,"2015 04-33",,,,,,,,Paper,,,,,,,,,,,,,,,,,,,,,,,,,,,,,,,,,,,,,,,,,,,,,,,,,,,,,,,,,,,,,,,,,,,,,,"1980's,Andrews, North Carolina,Anthony El-Khouri,Barbara El-Khouri,Catherine El-Khouri,Catholicism,El-Khouri,Family History,George Maron El-Khouri,Jabaley,Joseph El-Khouri,Mariam El-Khouri Gerber,Marsha El-Khouri Shiver,North Carolina,Religion,Rose Isaac El-Khouri,Theresa El-Khouri Martin",https://lebanesestudies.omeka.chass.ncsu.edu/files/original/c0ecbdddcc0b0c7b4ce28af4f77ab56b.pdf,Newspaper,"El-Khouri Family",1,0
998,https://lebanesestudies.omeka.chass.ncsu.edu/items/show/998,,,,,,,,,,,,,,,,,,,,,,,,,,,,,,,,,,,,,,,,,"""An Interesting Entertainment. Rev. Faddhul Moghabghab...will deliver a lecture..."" 1894",,,"The Wilmington Messenger","Special Collections Department, North Carolina Room, New Hanover County Public Library, Wilmington, North Carolina","The Wilmington Messenger^^Moise A. Khayrallah Center for Lebanese Diaspora Studies","December 14, 1894",,"Donor retains full ownership of any and all copyright currently controlled in agreement with Khayrallah Center. Nonexclusive right to authorize all uses of these materials for non-commercial research, scholarly, or other educational purposes are granted to Khayrallah Center pursuant to Creative Commons Attribution-NonCommercial-ShareAlike (CC BY-NC-SA).",,,English,,,,,,,,,,,,,,,,,,,,,,,,,,,,,,,,,,,,,,,,,,,,,,,,,,,,,,,,,,,,,,,,,,,,,,,,,,,,,,,,"1890's,American College Beirut,Beirut, Lebanon,Faddhul Moghabghab,Moghabghab,Mount Lebanon,Newspapers,Newspapers-Wilmington,North Carolina,Religion,Syrian,Wilmington, North Carolina",https://lebanesestudies.omeka.chass.ncsu.edu/files/original/65539c215f85b10f6bb27480d1e54f00.jpg,Newspaper,"North Carolina Newspapers",1,1
982,https://lebanesestudies.omeka.chass.ncsu.edu/items/show/982,,,,,,,,,,,,,,,,,,,,,,,,,,,,,,,,,,,,,,,,,"""Rev. G. M. Korkemas, a Maranite missionary...left today..."" 1900",,,"The News Dispatch","Special Collections Department, North Carolina Room, New Hanover County Public Library, Wilmington, North Carolina","""The News Dispatch""^^Moise A. Khayrallah Center for Lebanese Diaspora Studies","December 19, 1900",,"Donor retains full ownership of any and all copyright currently controlled in agreement with Khayrallah Center. Nonexclusive right to authorize all uses of these materials for non-commercial research, scholarly, or other educational purposes are granted to Khayrallah Center pursuant to Creative Commons Attribution-NonCommercial-ShareAlike (CC BY-NC-SA).",,,English,,,,,,,,,,,,,,,,,,,,,,,,,,,,,,,,,,,,,,,,,,,,,,,,,,,,,,,,,,,,,,,,,,,,,,,,,,,,,,,,"1900's,Maronite,Missionary,Newspapers,Newspapers-Wilmington,North Carolina,Raleigh, North Carolina,Religion,Wilmington, North Carolina",https://lebanesestudies.omeka.chass.ncsu.edu/files/original/9124c835c6f3f4e276ddd83081e32fdd.jpg,Newspaper,"North Carolina Newspapers",1,1
1000,https://lebanesestudies.omeka.chass.ncsu.edu/items/show/1000,,,,,,,,,,,,,,,,,,,,,,,,,,,,,,,,,,,,,,,,,"""Will Be Full of Interest.""",,,"The Wilmington Messenger","Special Collections Department, North Carolina Room, New Hanover County Public Library, Wilmington, North Carolina","The Wilmington Messenger^^Moise A. Khayrallah Center for Lebanese Diaspora Studies","December 5, 1894",,"Donor retains full ownership of any and all copyright currently controlled in agreement with Khayrallah Center. Nonexclusive right to authorize all uses of these materials for non-commercial research, scholarly, or other educational purposes are granted to Khayrallah Center pursuant to Creative Commons Attribution-NonCommercial-ShareAlike (CC BY-NC-SA).",,,English,,,,,,,,,,,,,,,,,,,,,,,,,,,,,,,,,,,,,,,,,,,,,,,,,,,,,,,,,,,,,,,,,,,,,,,,,,,,,,,,"1890's,Faddhul Moghabghab,Moghabghab,Newspapers,Newspapers-Wilmington,North Carolina,Religion,Wilmington, North Carolina",https://lebanesestudies.omeka.chass.ncsu.edu/files/original/7696ddbf39b530885c3f7d071652b5d3.jpg,Newspaper,"North Carolina Newspapers",1,1
999,https://lebanesestudies.omeka.chass.ncsu.edu/items/show/999,,,,,,,,,,,,,,,,,,,,,,,,,,,,,,,,,,,,,,,,,"""Lecture by an Arab Preacher."" 1894",,,"The Wilmington Messenger","Special Collections Department, North Carolina Room, New Hanover County Public Library, Wilmington, North Carolina","The Wilmington Messenger^^Moise A. Khayrallah Center for Lebanese Diaspora Studies","December 6, 1894",,"Donor retains full ownership of any and all copyright currently controlled in agreement with Khayrallah Center. Nonexclusive right to authorize all uses of these materials for non-commercial research, scholarly, or other educational purposes are granted to Khayrallah Center pursuant to Creative Commons Attribution-NonCommercial-ShareAlike (CC BY-NC-SA).",,,English,,,,,,,,,,,,,,,,,,,,,,,,,,,,,,,,,,,,,,,,,,,,,,,,,,,,,,,,,,,,,,,,,,,,,,,,,,,,,,,,"1890's,Arab,Faddhul Moghabghab,Moghabghab,Newspapers,Newspapers-Wilmington,North Carolina,Religion,Wilmington, North Carolina",https://lebanesestudies.omeka.chass.ncsu.edu/files/original/738896bf834799829e80de8793c3a7e7.jpg,Newspaper,"North Carolina Newspapers",1,1
1224,https://lebanesestudies.omeka.chass.ncsu.edu/items/show/1224,,,,,,,,,,,,,,,,,,,,,,,,,,,,,,,,,,,,,,,,,"Letter to Joseph Maroun El-Khouri from Joseph Beniamin El-Koury, 1960",Correspondence,"Letter to Joseph Maroun El-Khouri of Andrews, North Carolina from Joseph Beniamin El-Koury, of the diocesan seminary of Karm, Lebanon,  postmarked February 19, 1960. ","Joseph Beniamin El-Koury","Marsha El-Khouri Shiver","Moise A. Khayrallah Center for Lebanese Diaspora Studies","February 19, 1960",,"Donor retains full ownership of any and all copyright currently controlled in agreement with Khayrallah Center. Nonexclusive right to authorize all uses of these materials for non-commercial research, scholarly, or other educational purposes are granted to Khayrallah Center pursuant to Creative Commons Attribution-NonCommercial-ShareAlike (CC BY-NC-SA).",,Image/jpg,"Arabic, English",Text,"2015 05-11",,,,,,,,Paper,,,,,,,,,,,,,,,,,,,,,,,,,,,,,,,,,,,,,,,,,,,,,,,,,,,,,,,,,,,,,,,,,,,,,,"1960's,Andrews, North Carolina,Arabic,Correspondence,El-Khouri,El-Koury,Joseph Beniamin El-Koury,Joseph Maroun El-Khouri,Lebanon,North Carolina,Religion","https://lebanesestudies.omeka.chass.ncsu.edu/files/original/2cb1ce38bc66d123df619f5637f1615e.jpg,https://lebanesestudies.omeka.chass.ncsu.edu/files/original/78546d44292b043a708df7e438acdba0.jpg,https://lebanesestudies.omeka.chass.ncsu.edu/files/original/1ac564d0a1a49dbe87bc7bc1706dc888.jpg,https://lebanesestudies.omeka.chass.ncsu.edu/files/original/9b0c8a738c2743a11564c0cb0352586a.jpg",Document,"El-Khouri Family",1,1
1229,https://lebanesestudies.omeka.chass.ncsu.edu/items/show/1229,,,,,,,,,,,,,,,,,,,,,,,,,,,,,,,,,,,,,,,,,"Letter to Joseph Maroun El-Khouri from Sister Victorine El-Khouri, 1960",Correspondence,"Letter to Joseph Maroun El-Khouri of Andrews, North Carolina from Sister Victorine El-Khouri of the Hospital National, Homs, Syria, postmarked January 13, 1960.","Sister Victorine El-Khouri","Marsha El-Khouri Shiver","Moise A. Khayrallah Center for Lebanese Diaspora Studies","January 13, 1960",,"Donor retains full ownership of any and all copyright currently controlled in agreement with Khayrallah Center. Nonexclusive right to authorize all uses of these materials for non-commercial research, scholarly, or other educational purposes are granted to Khayrallah Center pursuant to Creative Commons Attribution-NonCommercial-ShareAlike (CC BY-NC-SA).",,Image/jpg,"Arabic, English",Text,"2015 05-16",,,,,,,,Paper,,,,,,,,,,,,,,,,,,,,,,,,,,,,,,,,,,,,,,,,,,,,,,,,,,,,,,,,,,,,,,,,,,,,,,"1960's,Andrews, North Carolina,Arabic,Correspondence,El-Khouri,Homs Syria,Hospital,Joseph Maroun El-Khouri,North Carolina,Nuns,Religion,Siblings,Sister Victorine El-Khouri,Syria","https://lebanesestudies.omeka.chass.ncsu.edu/files/original/e52f9a461ca8a4633ad73deb4d297555.jpg,https://lebanesestudies.omeka.chass.ncsu.edu/files/original/c0d023e0cc00df712ed15a916dfd0d4b.jpg,https://lebanesestudies.omeka.chass.ncsu.edu/files/original/448cd29dedc777a263e92e2a9fc6cec2.jpg,https://lebanesestudies.omeka.chass.ncsu.edu/files/original/6b62592cd02e3a6b0bfc3070252e94bd.jpg,https://lebanesestudies.omeka.chass.ncsu.edu/files/original/8e0dcb325e3b4124f0bb2ce941e3d81c.jpg",Document,"El-Khouri Family",1,1
12017,https://lebanesestudies.omeka.chass.ncsu.edu/items/show/12017,,,,,,,,,,,,,,,,,,,,,,,,,,,,,,,,,,,,,,,,,"""Life in Lebanon--Christmas Time""",Periodicals^^Culture--Lebanon,"One of a series of articles in The Andrews Journal following George and Barbara El-Khouri's trip to Lebanon. (Folder 13-6)","George Maron El-Khouri","Marsha El-Khouri Shiver","Moise A. Khayrallah Center for Lebanese Diaspora Studies","January 30, 1974",,"Donor retains full ownership of any and all copyright currently controlled in agreement with Khayrallah Center. Nonexclusive right to authorize all uses of these materials for non-commercial research, scholarly, or other educational purposes are granted to Khayrallah Center pursuant to Creative Commons Attribution-NonCommercial-ShareAlike (CC BY-NC-SA).",http://lebanesestudies.omeka.chass.ncsu.edu/items/show/12011,Text/jpg,English,Text,"2016 13-06",,,,,,,,Newspaper,,,,,,,,,,,,,,,,,,,,,,,,,,,,,,,,,,,,,,,,,,,,,,,,,,,,,,,,,,,,,,,,,,,,,,"1970's,Christianity,Culture-Lebanese,El-Khouri,George El-Khouri,Holiday-Christmas,Holidays,Kour, Batroun, Lebanon,Lebanon,Religion,The Andrews Journal",https://lebanesestudies.omeka.chass.ncsu.edu/files/original/b99ded0f412501ef4a43f8dd2f03d31f.tif,Document,"El-Khouri Family",1,0
953,https://lebanesestudies.omeka.chass.ncsu.edu/items/show/953,,,,,,,,,,,,,,,,,,,,,,,,,,,,,,,,,,,,,,,,,"""A party of about twenty Syrians arrived here yesterday."" 1897",,,"The News Dispatch","Special Collections Department, North Carolina Room, New Hanover County Public Library, Wilmington, North Carolina","""The News Dispatch""^^Moise A. Khayrallah Center for Lebanese Diaspora Studies","June 15, 1897",,"Donor retains full ownership of any and all copyright currently controlled in agreement with Khayrallah Center. Nonexclusive right to authorize all uses of these materials for non-commercial research, scholarly, or other educational purposes are granted to Khayrallah Center pursuant to Creative Commons Attribution-NonCommercial-ShareAlike (CC BY-NC-SA).",,,English,,,,,,,,,,,,,,,,,,,,,,,,,,,,,,,,,,,,,,,,,,,,,,,,,,,,,,,,,,,,,,,,,,,,,,,,,,,,,,,,"1890's,Catholicism,Immigrants,Newspapers,Newspapers-Wilmington,North Carolina,Priests,Religion,Syrian,Wilmington, North Carolina",https://lebanesestudies.omeka.chass.ncsu.edu/files/original/3860b6b83ecfb6f0bf852ed279a7bd4f.jpg,Newspaper,"North Carolina Newspapers",1,1