﻿"Item Id","Item URI","Dublin Core:Alternative Title","Dublin Core:Abstract","Dublin Core:Table Of Contents","Dublin Core:Date Available","Dublin Core:Date Created","Dublin Core:Date Accepted","Dublin Core:Date Copyrighted","Dublin Core:Date Submitted","Dublin Core:Date Issued","Dublin Core:Date Modified","Dublin Core:Date Valid","Dublin Core:Access Rights","Dublin Core:License","Dublin Core:Conforms To","Dublin Core:Has Format","Dublin Core:Has Part","Dublin Core:Has Version","Dublin Core:Is Format Of","Dublin Core:Is Part Of","Dublin Core:Is Referenced By","Dublin Core:Is Replaced By","Dublin Core:Is Required By","Dublin Core:Is Version Of","Dublin Core:References","Dublin Core:Replaces","Dublin Core:Requires","Dublin Core:Extent","Dublin Core:Medium","Dublin Core:Bibliographic Citation","Dublin Core:Spatial Coverage","Dublin Core:Temporal Coverage","Dublin Core:Accrual Method","Dublin Core:Accrual Periodicity","Dublin Core:Accrual Policy","Dublin Core:Audience","Dublin Core:Audience Education Level","Dublin Core:Mediator","Dublin Core:Instructional Method","Dublin Core:Provenance","Dublin Core:Rights Holder","Dublin Core:Title","Dublin Core:Subject","Dublin Core:Description","Dublin Core:Creator","Dublin Core:Source","Dublin Core:Publisher","Dublin Core:Date","Dublin Core:Contributor","Dublin Core:Rights","Dublin Core:Relation","Dublin Core:Format","Dublin Core:Language","Dublin Core:Type","Dublin Core:Identifier","Dublin Core:Coverage","Item Type Metadata:Text","Item Type Metadata:Interviewer","Item Type Metadata:Interviewee","Item Type Metadata:Location","Item Type Metadata:Transcription","Item Type Metadata:Local URL","Item Type Metadata:Original Format","Item Type Metadata:Physical Dimensions","Item Type Metadata:Duration","Item Type Metadata:Compression","Item Type Metadata:Producer","Item Type Metadata:Director","Item Type Metadata:Bit Rate/Frequency","Item Type Metadata:Time Summary","Item Type Metadata:Email Body","Item Type Metadata:Subject Line","Item Type Metadata:From","Item Type Metadata:To","Item Type Metadata:CC","Item Type Metadata:BCC","Item Type Metadata:Number of Attachments","Item Type Metadata:Standards","Item Type Metadata:Objectives","Item Type Metadata:Materials","Item Type Metadata:Lesson Plan Text","Item Type Metadata:URL","Item Type Metadata:Event Type","Item Type Metadata:Participants","Item Type Metadata:Birth Date","Item Type Metadata:Birthplace","Item Type Metadata:Death Date","Item Type Metadata:Occupation","Item Type Metadata:Biographical Text","Item Type Metadata:Bibliography","Item Type Metadata:First Name (English)","Item Type Metadata:Last Name (English)","Item Type Metadata:Address","Item Type Metadata:City","Item Type Metadata:State","Item Type Metadata:Business (English)","Item Type Metadata:Provenance (English)","Item Type Metadata:Provenance (Arabic)","Item Type Metadata:Business (Arabic)","Item Type Metadata:Last Name (Arabic)","Item Type Metadata:First Name (Arabic)","Item Type Metadata:Player","Omeka Legacy File:Additional Creator","Omeka Legacy File:Transcriber","Omeka Legacy File:Producer","Omeka Legacy File:Render Device","Omeka Legacy File:Render Details","Omeka Legacy File:Capture Date","Omeka Legacy File:Capture Device","Omeka Legacy File:Capture Details","Omeka Legacy File:Change History","Omeka Legacy File:Watermark","Omeka Legacy File:Encryption","Omeka Legacy File:Compression","Omeka Legacy File:Post Processing","Omeka Image File:Width","Omeka Image File:Height","Omeka Image File:Bit Depth","Omeka Image File:Channels","Omeka Image File:Exif String","Omeka Image File:Exif Array","Omeka Image File:IPTC String","Omeka Image File:IPTC Array","Omeka Video File:Bitrate","Omeka Video File:Duration","Omeka Video File:Sample Rate","Omeka Video File:Codec","Omeka Video File:Width","Omeka Video File:Height","PDF Text:Text","Users Elements:Test","Test Elements:Test",tags,file,itemType,collection,public,featured
86903,https://lebanesestudies.omeka.chass.ncsu.edu/items/show/86903,,,,,,,,,,,,,,,,,,,,,,,,,,,,,,,,,,,,,,,,,"Photograph and Description by Kail Ellis of Edmond el Khazen, c. 2000s","Writing--History^^ Genealogy^^ Photographs","A photograph and description of Edmond el Khazen, Angele Ellis' first cousin on her mother's side, written by Kail Ellis circa 2000s. The photograph is undated.","Kail Ellis","Kail Ellis","Moise A. Khayrallah Center for Lebanese Diaspora Studies"," circa 2000s",,"The donor retains full ownership of any copyright and rights currently controlled. Nonexclusive right to authorize uses of these materials for non-commercial research, scholarly, or other educational purposes are granted to Khayrallah Center pursuant to U.S. Copyright Law. Usage of the materials for these purposes must be fully credited with the source. The user assumes full responsibility for any use of the materials.",,Image/pdf,English,Image,KEllis2018-410,,,,,,,,,,,,,,,,,,,,,,,,,,,,,,,,,,,,,,,,,,,,,,,,,,,,,,,,,,,,,,,,,,,,,,,,,,,,,,"2000s,Families",https://lebanesestudies.omeka.chass.ncsu.edu/files/original/4a3532ca66daec7a884f51e29e098f50.pdf,,"Kmeid-Ellis Collection Series 2: Photographs",1,0
85804,https://lebanesestudies.omeka.chass.ncsu.edu/items/show/85804,,,,,,,,,,,,,,,,,,,,,,,,,,,,,,,,,,,,,,,,,"Certificate from Father Mikhail, 1862 May 20","Conflict dispute^^ Dispute resolution (Law)","A photocopy of a certificate concerning water shares signed by Father Mikhail (spelled Mikheal in document) including the names Ghalib Slaiman Hobeiche (spelled Habeesh in the record) and Archbishop Antoun al Khazen, dated 20 May 1862.","Father Mikhail","Kail Ellis","Moise A. Khayrallah Center for Lebanese Diaspora Studies","1862 May 20",,"The donor retains full ownership of any copyright and rights currently controlled. Nonexclusive right to authorize uses of these materials for non-commercial research, scholarly, or other educational purposes are granted to Khayrallah Center pursuant to U.S. Copyright Law. Usage of the materials for these purposes must be fully credited with the source. The user assumes full responsibility for any use of the materials.",,Text/pdf,Arabic,Text,KEllis2018-001,,,,,,,,,,,,,,,,,,,,,,,,,,,,,,,,,,,,,,,,,,,,,,,,,,,,,,,,,,,,,,,,,,,,,,,,,,,,,,1860s,https://lebanesestudies.omeka.chass.ncsu.edu/files/original/50b6e57ad99d0c8a856ddb938ed222c4.pdf,,"Kmeid-Ellis Collection Series 1: Correspondence and Documents",1,0
84865,https://lebanesestudies.omeka.chass.ncsu.edu/items/show/84865,,,,,,,,,,,,,,,,,,,,,,,,,,,,,,,,,,,,,,,,,"English to Arabic Dictionary with a Note Inside, 15 November 1896",,"An English and Arabic dictionary with a teal cover. The title reads Al-Bakoorat Al-Gharbeyat Fee Taleem Al-Lughat Al-Englezeyat. In the front cover is a short note written in Arabic. The book is dated 15 November 1896.",,"Kail Ellis","Moise A. Khayrallah Center for Lebanese Diaspora Studies","1896 Nov 15",,"The donor retains full ownership of any copyright and rights currently controlled. Nonexclusive right to authorize uses of these materials for non-commercial research, scholarly, or other educational purposes are granted to Khayrallah Center pursuant to U.S. Copyright Law. Usage of the materials for these purposes must be fully credited with the source. The user assumes full responsibility for any use of the materials.",,Text/pdf,"English^^ Arabic",Text,KEllis2020-889,,,,,,,,,,,,,,,,,,,,,,,,,,,,,,,,,,,,,,,,,,,,,,,,,,,,,,,,,,,,,,,,,,,,,,,,,,,,,,"1890s,Translations",https://lebanesestudies.omeka.chass.ncsu.edu/files/original/b1ba3f6002879a266b25987dce6034b9.pdf,,"Kmeid-Ellis Collection Series 1: Correspondence and Documents",1,0
85821,https://lebanesestudies.omeka.chass.ncsu.edu/items/show/85821,,,,,,,,,,,,,,,,,,,,,,,,,,,,,,,,,,,,,,,,,"Photograph of Large Stone Building and Alfreda Ellis with Unknown Man, 3 November 2002",Photographs,"A photograph of a large stone building and green wrought iron windows. Next to the building is Alfreda Ellis talking to an unknown man while another man walks by. Alfreda Ellis is wearing a black outfit and holding a beige purse. Around the building are a varety of plants and trees. This photograph, amongst others, was found in the back cover of an Arabic book, dated November 3, 2002.",,"Kail Ellis","Moise A. Khayrallah Center for Lebanese Diaspora Studies","1896 November 11",,"The donor retains full ownership of any copyright and rights currently controlled. Nonexclusive right to authorize uses of these materials for non-commercial research, scholarly, or other educational purposes are granted to Khayrallah Center pursuant to U.S. Copyright Law. Usage of the materials for these purposes must be fully credited with the source. The user assumes full responsibility for any use of the materials.",,Image/pdf,,Image,KEllis2020-886,,,,,,,,,,,,,,,,,,,,,,,,,,,,,,,,,,,,,,,,,,,,,,,,,,,,,,,,,,,,,,,,,,,,,,,,,,,,,,2000s,https://lebanesestudies.omeka.chass.ncsu.edu/files/original/712047981f3f77ea47e43d855a5b5a00.pdf,,"Kmeid-Ellis Collection Series 2: Photographs",1,0
85307,https://lebanesestudies.omeka.chass.ncsu.edu/items/show/85307,,,,,,,,,,,,,,,,,,,,,,,,,,,,,,,,,,,,,,,,,"Holy Card of Madonna Della Pace, 1899 March 18","Holy cards","A holy card depicting Madonna Della Pace (Madonna of Peace), dated 18 March 1899. Inscription on back written in French, including 'Lucerne (Suisse) and dates 18 March 1899 and 19 March 1899.",,"Kail Ellis","Moise A. Khayrallah Center for Lebanese Diaspora Studies","1899 March 18",,"The donor retains full ownership of any copyright and rights currently controlled. Nonexclusive right to authorize uses of these materials for non-commercial research, scholarly, or other educational purposes are granted to Khayrallah Center pursuant to U.S. Copyright Law. Usage of the materials for these purposes must be fully credited with the source. The user assumes full responsibility for any use of the materials.",,Text/pdf,French,Text,KEllis2020-003,,,,,,,,,,,,,,,,,,,,,,,,,,,,,,,,,,,,,,,,,,,,,,,,,,,,,,,,,,,,,,,,,,,,,,,,,,,,,,1890s,https://lebanesestudies.omeka.chass.ncsu.edu/files/original/a86bb3eedcb36b9b83967073994b3061.pdf,,"Kmeid-Ellis Collection Series 1: Correspondence and Documents",1,0
86697,https://lebanesestudies.omeka.chass.ncsu.edu/items/show/86697,,,,,,,,,,,,,,,,,,,,,,,,,,,,,,,,,,,,,,,,,"Photograph of Lebanese Immigrants in Carthage, New York in from of Department Store on State Street, 1910",Photographs,"A copy of a photograph of a group of Lebanese Immigrants from Bqaatouta (Bkaatouta, Bqaatouta), Lebanon in Carthage, New York in front of a department store.",,"Kail Ellis","Moise A. Khayrallah Center for Lebanese Diaspora Studies",1910,,"The donor retains full ownership of any copyright and rights currently controlled. Nonexclusive right to authorize uses of these materials for non-commercial research, scholarly, or other educational purposes are granted to Khayrallah Center pursuant to U.S. Copyright Law. Usage of the materials for these purposes must be fully credited with the source. The user assumes full responsibility for any use of the materials.",,Image/pdf,,Image,KEllis2019-218,,,,,,,,,,,,,,,,,,,,,,,,,,,,,,,,,,,,,,,,,,,,,,,,,,,,,,,,,,,,,,,,,,,,,,,,,,,,,,"1910s,Immigration,Lebanon,New York",https://lebanesestudies.omeka.chass.ncsu.edu/files/original/f8aa878f0f463224de633579e9ac9d9f.pdf,,"Kmeid-Ellis Collection Series 2: Photographs",1,0
86573,https://lebanesestudies.omeka.chass.ncsu.edu/items/show/86573,,,,,,,,,,,,,,,,,,,,,,,,,,,,,,,,,,,,,,,,,"Portrait of Younger Toufic Ellis Wearing Long Coat, c. 1910s",Photographs,"A portrait of a younger Toufic Ellis standing and wearing long coat.",,"Kail Ellis","Moise A. Khayrallah Center for Lebanese Diaspora Studies",1910s,,"The donor retains full ownership of any copyright and rights currently controlled. Nonexclusive right to authorize uses of these materials for non-commercial research, scholarly, or other educational purposes are granted to Khayrallah Center pursuant to U.S. Copyright Law. Usage of the materials for these purposes must be fully credited with the source. The user assumes full responsibility for any use of the materials.",,Image/pdf,,Image,KEllis2020-337,,,,,,,,,,,,,,,,,,,,,,,,,,,,,,,,,,,,,,,,,,,,,,,,,,,,,,,,,,,,,,,,,,,,,,,,,,,,,,"1910s,portrait",https://lebanesestudies.omeka.chass.ncsu.edu/files/original/3a048d17b9efa5f157b776d02b766d4f.pdf,,"Kmeid-Ellis Collection Series 2: Photographs",1,0
86623,https://lebanesestudies.omeka.chass.ncsu.edu/items/show/86623,,,,,,,,,,,,,,,,,,,,,,,,,,,,,,,,,,,,,,,,,"Photograph of Toufic Ellis Standing in Field, c. 1910s",Photographs,"A photograph of Toufic Ellis wearing a suit and standing in a field.",,"Kail Ellis","Moise A. Khayrallah Center for Lebanese Diaspora Studies",1910s,,"The donor retains full ownership of any copyright and rights currently controlled. Nonexclusive right to authorize uses of these materials for non-commercial research, scholarly, or other educational purposes are granted to Khayrallah Center pursuant to U.S. Copyright Law. Usage of the materials for these purposes must be fully credited with the source. The user assumes full responsibility for any use of the materials.",,Image/pdf,,Image,KEllis2020-312,,,,,,,,,,,,,,,,,,,,,,,,,,,,,,,,,,,,,,,,,,,,,,,,,,,,,,,,,,,,,,,,,,,,,,,,,,,,,,1910s,https://lebanesestudies.omeka.chass.ncsu.edu/files/original/92064b5493e0f8e69e4a232209d22dad.pdf,,"Kmeid-Ellis Collection Series 2: Photographs",1,0
86625,https://lebanesestudies.omeka.chass.ncsu.edu/items/show/86625,,,,,,,,,,,,,,,,,,,,,,,,,,,,,,,,,,,,,,,,,"Portrait of Younger Toufic Ellis, c. 1910s",Photographs,"A portrait of a younger Toufic Ellis wearing a striped suit and a tie. ",,"Kail Ellis","Moise A. Khayrallah Center for Lebanese Diaspora Studies",1910s,,"The donor retains full ownership of any copyright and rights currently controlled. Nonexclusive right to authorize uses of these materials for non-commercial research, scholarly, or other educational purposes are granted to Khayrallah Center pursuant to U.S. Copyright Law. Usage of the materials for these purposes must be fully credited with the source. The user assumes full responsibility for any use of the materials.",,Image/pdf,,Image,KEllis2020-311,,,,,,,,,,,,,,,,,,,,,,,,,,,,,,,,,,,,,,,,,,,,,,,,,,,,,,,,,,,,,,,,,,,,,,,,,,,,,,"1910s,portrait",https://lebanesestudies.omeka.chass.ncsu.edu/files/original/5d5e7da4f726c7b81e39e18d2ec53cf3.pdf,,"Kmeid-Ellis Collection Series 2: Photographs",1,0
86627,https://lebanesestudies.omeka.chass.ncsu.edu/items/show/86627,,,,,,,,,,,,,,,,,,,,,,,,,,,,,,,,,,,,,,,,,"Portrait of Younger Toufic Ellis, c. 1910s",Photographs,"A portrait of a younger Toufic Ellis wearing a dark suit and tie. ",,"Kail Ellis","Moise A. Khayrallah Center for Lebanese Diaspora Studies",1910s,,"The donor retains full ownership of any copyright and rights currently controlled. Nonexclusive right to authorize uses of these materials for non-commercial research, scholarly, or other educational purposes are granted to Khayrallah Center pursuant to U.S. Copyright Law. Usage of the materials for these purposes must be fully credited with the source. The user assumes full responsibility for any use of the materials.",,Image/pdf,,Image,KEllis2020-310,,,,,,,,,,,,,,,,,,,,,,,,,,,,,,,,,,,,,,,,,,,,,,,,,,,,,,,,,,,,,,,,,,,,,,,,,,,,,,"1910s,portrait",https://lebanesestudies.omeka.chass.ncsu.edu/files/original/9f8cdbac8252d0ab1c90ad7df6d6b86b.pdf,,"Kmeid-Ellis Collection Series 2: Photographs",1,0
86629,https://lebanesestudies.omeka.chass.ncsu.edu/items/show/86629,,,,,,,,,,,,,,,,,,,,,,,,,,,,,,,,,,,,,,,,,"Portrait of Younger Toufic Ellis Wearing Long Coat, c. 1910s",Photographs,"A portrait of a younger Toufic Ellis standing and wearing long coat.",,"Kail Ellis","Moise A. Khayrallah Center for Lebanese Diaspora Studies",1910s,,"The donor retains full ownership of any copyright and rights currently controlled. Nonexclusive right to authorize uses of these materials for non-commercial research, scholarly, or other educational purposes are granted to Khayrallah Center pursuant to U.S. Copyright Law. Usage of the materials for these purposes must be fully credited with the source. The user assumes full responsibility for any use of the materials.",,Image/pdf,,Image,KEllis2020-309,,,,,,,,,,,,,,,,,,,,,,,,,,,,,,,,,,,,,,,,,,,,,,,,,,,,,,,,,,,,,,,,,,,,,,,,,,,,,,"1910s,portrait",https://lebanesestudies.omeka.chass.ncsu.edu/files/original/7d8c26fa5c2fff0be1d3d6429783393a.pdf,,"Kmeid-Ellis Collection Series 2: Photographs",1,0
86631,https://lebanesestudies.omeka.chass.ncsu.edu/items/show/86631,,,,,,,,,,,,,,,,,,,,,,,,,,,,,,,,,,,,,,,,,"Portrait of Younger Toufic Ellis, c. 1910s",Photographs,"A portrait of a younger Toufic Ellis wearing a tie with a spiral pattern.",,"Kail Ellis","Moise A. Khayrallah Center for Lebanese Diaspora Studies",1910s,,"The donor retains full ownership of any copyright and rights currently controlled. Nonexclusive right to authorize uses of these materials for non-commercial research, scholarly, or other educational purposes are granted to Khayrallah Center pursuant to U.S. Copyright Law. Usage of the materials for these purposes must be fully credited with the source. The user assumes full responsibility for any use of the materials.",,Image/pdf,,Image,KEllis2020-308,,,,,,,,,,,,,,,,,,,,,,,,,,,,,,,,,,,,,,,,,,,,,,,,,,,,,,,,,,,,,,,,,,,,,,,,,,,,,,"1910s,portrait",https://lebanesestudies.omeka.chass.ncsu.edu/files/original/c081230858ee62370a64e7b0c056f75a.pdf,,"Kmeid-Ellis Collection Series 2: Photographs",1,0
86633,https://lebanesestudies.omeka.chass.ncsu.edu/items/show/86633,,,,,,,,,,,,,,,,,,,,,,,,,,,,,,,,,,,,,,,,,"Portrait of a Man Wearing Dark Suit, c. 1910s",Photographs,"A portrait of an unidentified man.",,"Kail Ellis","Moise A. Khayrallah Center for Lebanese Diaspora Studies",1910s,,"The donor retains full ownership of any copyright and rights currently controlled. Nonexclusive right to authorize uses of these materials for non-commercial research, scholarly, or other educational purposes are granted to Khayrallah Center pursuant to U.S. Copyright Law. Usage of the materials for these purposes must be fully credited with the source. The user assumes full responsibility for any use of the materials.",,Image/pdf,,Image,KEllis2020-307,,,,,,,,,,,,,,,,,,,,,,,,,,,,,,,,,,,,,,,,,,,,,,,,,,,,,,,,,,,,,,,,,,,,,,,,,,,,,,"1910s,portrait",https://lebanesestudies.omeka.chass.ncsu.edu/files/original/37f88f09440946fcf569ef63dc1fbe08.pdf,,"Kmeid-Ellis Collection Series 2: Photographs",1,0
86635,https://lebanesestudies.omeka.chass.ncsu.edu/items/show/86635,,,,,,,,,,,,,,,,,,,,,,,,,,,,,,,,,,,,,,,,,"Photograph of Yousef Younis, c. 1910s",Photographs,"A photograph of Yousef Younis  ",,"Kail Ellis","Moise A. Khayrallah Center for Lebanese Diaspora Studies",1910s,,"The donor retains full ownership of any copyright and rights currently controlled. Nonexclusive right to authorize uses of these materials for non-commercial research, scholarly, or other educational purposes are granted to Khayrallah Center pursuant to U.S. Copyright Law. Usage of the materials for these purposes must be fully credited with the source. The user assumes full responsibility for any use of the materials.",,Image/pdf,,Image,KEllis2020-306,,,,,,,,,,,,,,,,,,,,,,,,,,,,,,,,,,,,,,,,,,,,,,,,,,,,,,,,,,,,,,,,,,,,,,,,,,,,,,1910s,https://lebanesestudies.omeka.chass.ncsu.edu/files/original/c3b4681cc5c0ef1b24263b690b2d4caa.pdf,,"Kmeid-Ellis Collection Series 2: Photographs",1,0
86637,https://lebanesestudies.omeka.chass.ncsu.edu/items/show/86637,,,,,,,,,,,,,,,,,,,,,,,,,,,,,,,,,,,,,,,,,"Photograph of Yousef Younis Standing On Sidewalk, c. 1910s",Photographs,"A photograph of Yousef Younis standing outside on the sidewalk in front of a building. ",,"Kail Ellis","Moise A. Khayrallah Center for Lebanese Diaspora Studies",1910s,,"The donor retains full ownership of any copyright and rights currently controlled. Nonexclusive right to authorize uses of these materials for non-commercial research, scholarly, or other educational purposes are granted to Khayrallah Center pursuant to U.S. Copyright Law. Usage of the materials for these purposes must be fully credited with the source. The user assumes full responsibility for any use of the materials.",,Image/pdf,,Image,KEllis2020-305,,,,,,,,,,,,,,,,,,,,,,,,,,,,,,,,,,,,,,,,,,,,,,,,,,,,,,,,,,,,,,,,,,,,,,,,,,,,,,1910s,https://lebanesestudies.omeka.chass.ncsu.edu/files/original/2677df6f068bbf008adbdbb1a896af2f.pdf,,"Kmeid-Ellis Collection Series 2: Photographs",1,0
86639,https://lebanesestudies.omeka.chass.ncsu.edu/items/show/86639,,,,,,,,,,,,,,,,,,,,,,,,,,,,,,,,,,,,,,,,,"Photograph of Toufic Ellis and Younis Kmeid Mock Fighting, c. 1910s",Photographs,"A photograph of Toufic Ellis and Younis Kmeid mock fighting outside of a building, labeled 'Pop &amp^^ Younis Kmeid died during flu 1918'",,"Kail Ellis","Moise A. Khayrallah Center for Lebanese Diaspora Studies",1910s,,"The donor retains full ownership of any copyright and rights currently controlled. Nonexclusive right to authorize uses of these materials for non-commercial research, scholarly, or other educational purposes are granted to Khayrallah Center pursuant to U.S. Copyright Law. Usage of the materials for these purposes must be fully credited with the source. The user assumes full responsibility for any use of the materials.",,Image/pdf,English,Image,KEllis2020-304,,,,,,,,,,,,,,,,,,,,,,,,,,,,,,,,,,,,,,,,,,,,,,,,,,,,,,,,,,,,,,,,,,,,,,,,,,,,,,1910s,https://lebanesestudies.omeka.chass.ncsu.edu/files/original/c71c9689ca04dc2bdcb924440156249a.pdf,,"Kmeid-Ellis Collection Series 2: Photographs",1,0
86645,https://lebanesestudies.omeka.chass.ncsu.edu/items/show/86645,,,,,,,,,,,,,,,,,,,,,,,,,,,,,,,,,,,,,,,,,"Photograph of Habib Salome Sitting with Two Americans, c. 1910s",Photographs,"A photograph of Habib Salome sitting on a step next to two other people, labeled 'Right - Habib Salome, Left - Americans'",,"Kail Ellis","Moise A. Khayrallah Center for Lebanese Diaspora Studies",1910s,,"The donor retains full ownership of any copyright and rights currently controlled. Nonexclusive right to authorize uses of these materials for non-commercial research, scholarly, or other educational purposes are granted to Khayrallah Center pursuant to U.S. Copyright Law. Usage of the materials for these purposes must be fully credited with the source. The user assumes full responsibility for any use of the materials.",,Image/pdf,English,Image,KEllis2020-301,,,,,,,,,,,,,,,,,,,,,,,,,,,,,,,,,,,,,,,,,,,,,,,,,,,,,,,,,,,,,,,,,,,,,,,,,,,,,,1910s,https://lebanesestudies.omeka.chass.ncsu.edu/files/original/c5d13600d0523b2cf2ba923373ee8a16.pdf,,"Kmeid-Ellis Collection Series 2: Photographs",1,0
86647,https://lebanesestudies.omeka.chass.ncsu.edu/items/show/86647,,,,,,,,,,,,,,,,,,,,,,,,,,,,,,,,,,,,,,,,,"Photograph of Ishiyyah Khalil, c. 1910s",Photographs,"A photograph of man standing on balcony, leaning against a wall labeled 'Ishiyyah Khalil, lived in Utica'",,"Kail Ellis","Moise A. Khayrallah Center for Lebanese Diaspora Studies",1910s,,"The donor retains full ownership of any copyright and rights currently controlled. Nonexclusive right to authorize uses of these materials for non-commercial research, scholarly, or other educational purposes are granted to Khayrallah Center pursuant to U.S. Copyright Law. Usage of the materials for these purposes must be fully credited with the source. The user assumes full responsibility for any use of the materials.",,Image/pdf,English,Image,KEllis2020-300,,,,,,,,,,,,,,,,,,,,,,,,,,,,,,,,,,,,,,,,,,,,,,,,,,,,,,,,,,,,,,,,,,,,,,,,,,,,,,"1910s,New York",https://lebanesestudies.omeka.chass.ncsu.edu/files/original/e8df3305f5fba57440344260529652af.pdf,,"Kmeid-Ellis Collection Series 2: Photographs",1,0